program: Orca
programVersion: 5.0.2
elementType: O O O O N N C C C C C C C C C C C C C C C C C H H H H H H H H H H H H H H H H H H H H H H
charge: 0
multiplicity: 1
keywords: wb97x-d3
keywords: def2-TZVPP
keywords: def2/J RIJCOSX
keywords: DEFGRID2
keywords: scfconv7
keywords: smallprint printgap noloewdin
keywords: NOSOSCF
formula: C17H22N2O4
InChI: InChI=1/C17H22N2O4/c1-6-7-18-9-13(20)19(16(18)22)10-23-15(21)14-12(8-11(2)3)17(14,4)5/h1,8,12,14H,7,9-10H2,2-5H3
45 atoms
O  0.902302 1.831098 -0.953542
O  1.221163 1.100403 1.133773
O  -1.530937 2.161956 2.061643
O  -1.68541 0.863716 -2.309449
N  -1.337115 1.735097 -0.195006
N  -2.941529 0.245304 -0.476511
C  3.882811 -0.127518 0.106066
C  2.84797 -1.121504 -0.282938
C  2.658603 0.362527 -0.643528
C  5.15301 -0.100364 -0.7125
C  4.121334 0.220698 1.554535
C  1.962298 -1.796453 0.693911
C  1.559847 1.110276 -0.025326
C  0.774707 -2.312932 0.366182
C  -0.081643 -3.013543 1.373491
C  0.228992 -2.216914 -1.031073
C  -0.228734 2.576255 -0.54323
C  -1.867074 1.57894 1.059527
C  -1.976673 0.914377 -1.132531
C  -2.963839 0.557814 0.92848
C  -3.818747 -0.724287 -1.084891
C  -3.71002 -2.037676 -0.4578
C  -3.63533 -3.108967 0.080291
H  3.076057 -1.712525 -1.166825
H  2.818483 0.601619 -1.687845
H  4.971737 -0.360107 -1.756215
H  5.610604 0.890278 -0.688395
H  5.878848 -0.811931 -0.314347
H  4.481123 1.246636 1.647779
H  3.248075 0.115633 2.191214
H  4.897253 -0.434135 1.955631
H  2.313745 -1.891891 1.716423
H  -0.352351 -4.016233 1.03256
H  0.412328 -3.104812 2.340845
H  -1.022099 -2.475284 1.523187
H  0.794663 -2.848537 -1.721431
H  -0.808436 -2.546089 -1.080557
H  0.279193 -1.200342 -1.4258
H  -0.006063 3.224759 0.302753
H  -0.487222 3.195107 -1.398375
H  -2.74535 -0.312787 1.553456
H  -3.921223 0.977979 1.245551
H  -3.575189 -0.796666 -2.144707
H  -4.854181 -0.381181 -1.022889
H  -3.570618 -4.061736 0.558079
elementType: O N C H
totalener: -1071.53714756 hartree
nucrepener: 2069.02918361 hartree
electener: -3140.56633117 hartree
oneelecener: -5571.21172639 hartree
twoeener: 2430.64539522 hartree
cpcmener: -0.05357161 hartree
kineticenergy: 1066.86029009 hartree
xcener: -102.629213502568 hartree
chargesum: 0.0000000
charge: -0.289023 -0.481444 -0.474527 -0.517623 -0.106321 -0.118173 0.133675 -0.023611 -0.108601 -0.264626 -0.292711 -0.284092 0.417284 0.022461 -0.239429 -0.293695 0.065478 0.319164 0.360252 -0.012260 -0.040581 -0.438404 0.055004 0.116294 0.095053 0.087794 0.096725 0.095345 0.102839 0.090390 0.099974 0.127664 0.104955 0.093986 0.083568 0.120472 0.096198 0.085598 0.134827 0.151826 0.127774 0.134205 0.131567 0.146552 0.288198
qa: -0.2890 -0.4814 -0.4745 -0.5176 -0.1063 -0.1182 0.1337 -0.0236 -0.1086 -0.2646 -0.2927 -0.2841 0.4173 0.0225 -0.2394 -0.2937 0.0655 0.3192 0.3603 -0.0123 -0.0406 -0.4384 0.0550 0.1163 0.0951 0.0878 0.0967 0.0953 0.1028 0.0904 0.1000 0.1277 0.1050 0.0940 0.0836 0.1205 0.0962 0.0856 0.1348 0.1518 0.1278 0.1342 0.1316 0.1466 0.2882
va: 2.1036 2.0091 2.0363 1.9902 3.0945 3.1957 3.7695 3.8094 3.8322 3.8979 3.8902 3.8134 4.0706 3.6229 3.9275 3.9528 3.9070 4.1845 4.3071 3.8916 3.8744 3.7360 3.5637 1.0028 1.0322 1.0044 1.0023 1.0021 1.0002 1.0171 0.9988 1.0012 0.9913 1.0140 0.9885 0.9998 1.0067 1.0105 1.0165 0.9946 1.0008 1.0062 1.0092 0.9845 0.9460
dispcorr: -0.026359233 hartree
energy: -1071.563506795092
dipole: 16.37958 -17.36298 -0.98340 -15.26098 14.18147 -1.07950 1.93180 -2.59787 -0.66606
magnitude: 1.60501 au
magnitude: 4.07960 debye
