program: Orca
programVersion: 5.0.2
elementType: O O O O N N C C C C C C C C C C C C C C C C C H H H H H H H H H H H H H H H H H H H H H H
charge: 0
multiplicity: 1
keywords: wb97x-d3
keywords: def2-TZVPP
keywords: def2/J RIJCOSX
keywords: DEFGRID2
keywords: scfconv7
keywords: smallprint printgap noloewdin
keywords: NOSOSCF
formula: C17H22N2O4
InChI: InChI=1/C17H22N2O4/c1-6-7-18-9-13(20)19(16(18)22)10-23-15(21)14-12(8-11(2)3)17(14,4)5/h1,8,12,14H,7,9-10H2,2-5H3
45 atoms
O  0.895902 1.816043 -0.987805
O  1.227657 1.118658 1.109185
O  -1.506455 2.21219 2.041066
O  -1.711163 0.828039 -2.301979
N  -1.338029 1.740767 -0.208888
N  -2.949193 0.250252 -0.443986
C  3.878874 -0.134919 0.080468
C  2.838451 -1.131046 -0.287026
C  2.650207 0.347951 -0.666688
C  5.143326 -0.123318 -0.74733
C  4.127946 0.232089 1.522421
C  1.960288 -1.791998 0.706362
C  1.559216 1.110334 -0.051959
C  0.761288 -2.295825 0.400776
C  -0.080365 -2.992773 1.422881
C  0.189626 -2.194892 -0.985627
C  -0.230508 2.5715 -0.583632
C  -1.854827 1.610591 1.054221
C  -1.988942 0.90228 -1.12308
C  -2.955428 0.590267 0.954821
C  -3.835241 -0.728747 -1.023791
C  -3.716716 -2.030729 -0.374927
C  -3.633632 -3.091284 0.182752
H  3.059005 -1.734572 -1.164345
H  2.802876 0.570694 -1.715688
H  5.866365 -0.837418 -0.348627
H  4.952476 -0.389977 -1.787543
H  5.608807 0.863831 -0.734472
H  4.494677 1.256967 1.59859
H  3.257697 0.1418 2.165544
H  4.902181 -0.421829 1.928368
H  2.330407 -1.892752 1.721864
H  0.429833 -3.085769 2.381684
H  -1.016503 -2.451826 1.588283
H  -0.359788 -3.994937 1.087047
H  0.698153 -2.877586 -1.672319
H  -0.868889 -2.455609 -1.004374
H  0.294987 -1.193251 -1.405936
H  0.000445 3.236909 0.246941
H  -0.494392 3.173494 -1.449251
H  -2.732464 -0.268584 1.594211
H  -3.908122 1.01943 1.274042
H  -3.607425 -0.818831 -2.086045
H  -4.869721 -0.38356 -0.952291
H  -3.558345 -4.037106 0.671518
elementType: O N C H
totalener: -1071.53708982 hartree
nucrepener: 2070.15743440 hartree
electener: -3141.69452422 hartree
oneelecener: -5573.47354907 hartree
twoeener: 2431.77902485 hartree
cpcmener: -0.05356466 hartree
kineticenergy: 1066.85866162 hartree
xcener: -102.629044372882 hartree
chargesum: 0.0000000
charge: -0.288571 -0.480968 -0.474615 -0.517083 -0.106004 -0.118015 0.135020 -0.021679 -0.110082 -0.264852 -0.293663 -0.287475 0.416546 0.023659 -0.240449 -0.291347 0.064879 0.319715 0.357755 -0.011450 -0.042473 -0.441325 0.058714 0.116403 0.095416 0.095453 0.087769 0.096589 0.102632 0.090981 0.100039 0.127147 0.094201 0.083144 0.105267 0.122114 0.094710 0.085462 0.134983 0.151687 0.127906 0.134000 0.132210 0.146864 0.288782
qa: -0.2886 -0.4810 -0.4746 -0.5171 -0.1060 -0.1180 0.1350 -0.0217 -0.1101 -0.2649 -0.2937 -0.2875 0.4165 0.0237 -0.2404 -0.2913 0.0649 0.3197 0.3578 -0.0115 -0.0425 -0.4413 0.0587 0.1164 0.0954 0.0955 0.0878 0.0966 0.1026 0.0910 0.1000 0.1271 0.0942 0.0831 0.1053 0.1221 0.0947 0.0855 0.1350 0.1517 0.1279 0.1340 0.1322 0.1469 0.2888
va: 2.1031 2.0094 2.0363 1.9905 3.0945 3.1946 3.7652 3.8101 3.8325 3.8981 3.8904 3.8188 4.0717 3.6260 3.9287 3.9519 3.9078 4.1837 4.3093 3.8907 3.8737 3.7399 3.5580 1.0026 1.0322 1.0020 1.0044 1.0023 1.0003 1.0168 0.9986 1.0016 1.0140 0.9888 0.9911 0.9990 1.0070 1.0117 1.0164 0.9946 1.0011 1.0064 1.0089 0.9846 0.9458
dispcorr: -0.026453691 hartree
energy: -1071.563543508850
dipole: 16.32485 -17.31476 -0.98990 -15.25190 14.16284 -1.08907 2.04930 -2.68481 -0.63550
magnitude: 1.60307 au
magnitude: 4.07469 debye
