program: Orca
programVersion: 5.0.2
elementType: O O O O N N C C C C C C C C C C C C C C C C C H H H H H H H H H H H H H H H H H H H H H H
charge: 0
multiplicity: 1
keywords: wb97x-d3
keywords: def2-TZVPP
keywords: def2/J RIJCOSX
keywords: DEFGRID2
keywords: scfconv7
keywords: smallprint printgap noloewdin
keywords: NOSOSCF
formula: C17H22N2O4
InChI: InChI=1/C17H22N2O4/c1-6-7-18-9-13(20)19(16(18)22)10-23-15(21)14-12(8-11(2)3)17(14,4)5/h1,8,12,14H,7,9-10H2,2-5H3
45 atoms
O  0.336015 0.955648 -0.568295
O  1.054554 -1.024835 -1.335262
O  -2.507577 3.265616 -0.849765
O  -1.878693 -1.044721 0.483847
N  -1.964886 1.067223 -0.451427
N  -3.301399 0.60313 1.243418
C  2.646122 -1.110136 1.337571
C  3.580543 -0.553949 0.32229
C  2.188995 0.059805 0.475973
C  2.899447 -0.756771 2.784324
C  2.033408 -2.479036 1.171171
C  3.988861 -1.292976 -0.898144
C  1.167642 -0.104464 -0.566107
C  4.429256 -0.715653 -2.018608
C  4.844043 -1.52711 -3.207136
C  4.500733 0.769412 -2.201477
C  -0.852814 0.902252 -1.335884
C  -2.66086 2.2305 -0.252293
C  -2.350884 0.068991 0.450019
C  -3.653026 1.941215 0.84467
C  -4.059943 -0.154244 2.204572
C  -5.3492 -0.600987 1.679466
C  -6.410309 -0.964783 1.2508
H  4.346919 0.104962 0.723277
H  2.151979 1.017243 0.982131
H  3.327624 0.240546 2.893525
H  1.973658 -0.787558 3.362449
H  3.595747 -1.466964 3.235382
H  2.65615 -3.21898 1.678181
H  1.043864 -2.513309 1.631597
H  1.925616 -2.798498 0.138532
H  3.94333 -2.377214 -0.859803
H  4.248258 -1.263755 -4.085521
H  5.886616 -1.333867 -3.473635
H  4.732842 -2.597792 -3.035517
H  4.410028 1.323722 -1.268539
H  5.440675 1.062527 -2.674847
H  3.701197 1.111853 -2.865299
H  -0.850047 1.724862 -2.048031
H  -0.944239 -0.036202 -1.878518
H  -3.546441 2.659249 1.660998
H  -4.674292 2.008752 0.45708
H  -4.218591 0.45996 3.09337
H  -3.469251 -1.013862 2.523187
H  -7.352098 -1.286689 0.865687
elementType: O N C H
totalener: -1071.54372163 hartree
nucrepener: 1952.71004446 hartree
electener: -3024.25376609 hartree
oneelecener: -5338.46569291 hartree
twoeener: 2314.21192681 hartree
cpcmener: -0.04283773 hartree
kineticenergy: 1066.87441013 hartree
xcener: -102.624920769117 hartree
chargesum: -0.0000000
charge: -0.292400 -0.447036 -0.448756 -0.487020 -0.119315 -0.150829 0.129817 -0.033528 -0.085868 -0.261749 -0.295206 -0.252643 0.382163 -0.022023 -0.226689 -0.270899 0.073394 0.297539 0.389124 -0.002548 -0.057278 -0.428877 0.069180 0.111734 0.092966 0.086272 0.095816 0.093932 0.100597 0.098819 0.094503 0.120946 0.094415 0.094396 0.088704 0.093620 0.102412 0.101667 0.125883 0.141200 0.122089 0.124987 0.140612 0.132655 0.283222
qa: -0.2924 -0.4470 -0.4488 -0.4870 -0.1193 -0.1508 0.1298 -0.0335 -0.0859 -0.2617 -0.2952 -0.2526 0.3822 -0.0220 -0.2267 -0.2709 0.0734 0.2975 0.3891 -0.0025 -0.0573 -0.4289 0.0692 0.1117 0.0930 0.0863 0.0958 0.0939 0.1006 0.0988 0.0945 0.1209 0.0944 0.0944 0.0887 0.0936 0.1024 0.1017 0.1259 0.1412 0.1221 0.1250 0.1406 0.1327 0.2832
va: 2.0955 2.0433 2.0724 2.0337 3.1179 3.1844 3.7595 3.8398 3.8169 3.9005 3.8973 3.8420 4.1072 3.7218 3.9290 3.9462 3.8842 4.2018 4.3012 3.8940 3.9037 3.7433 3.5733 1.0041 1.0309 1.0046 1.0021 1.0024 0.9990 1.0056 1.0155 1.0004 0.9954 0.9969 1.0073 1.0045 1.0003 0.9967 1.0136 1.0173 1.0090 1.0036 0.9856 1.0040 0.9481
dispcorr: -0.021482361 hartree
energy: -1071.565203992768
dipole: 27.13946 -27.92885 -0.78939 -8.20695 9.10737 0.90042 0.93746 0.70338 1.64085
magnitude: 2.03133 au
magnitude: 5.16322 debye
