program: Gaussian 09
title: 000067581
version: EM64L-G09RevD.01
frameworkgroup: C1[X(C13H7ClF3NO3)]
method: RPBEPBE
basis: SDD
operation: Freq
keyword: #p
keyword: freq=noraman
keyword: PBEPBE/SDD
title: #p freq=noraman PBEPBE/SDD
converged: YES YES NO NO
title: Mulliken charges:
elementType: Cl F F F O O O N C C C C C C C C C C C C C H H H H H H H
charge: -0.036482 -0.163101 -0.161884 -0.156978 -0.263850 -0.189502 -0.164717 0.011316 0.245390 0.320450 0.261987 -0.464383 -0.309517 -0.325154 0.266434 0.362958 -0.339424 -0.365520 -0.177182 -0.169705 -0.125333 0.312165 0.286230 0.271354 0.274708 0.270718 0.264048 0.264975
chargesum: 0.00000
title: Mulliken charges with hydrogens summed into heavy atoms:
elementType: Cl F F F O O O N C C C C C C C C C C C C C
charge: -0.036482 -0.163101 -0.161884 -0.156978 -0.263850 -0.189502 -0.164717 0.011316 0.245390 0.320450 0.261987 -0.152219 -0.023287 -0.053800 0.266434 0.362958 -0.064715 -0.094802 0.086866 0.095269 -0.125333
polarizability: 2.74073837e+02 -1.56794113e+01 1.59630557e+02 -2.48331974e+00 -8.63129369e+00 1.06495442e+02
1716.lowfreq: -4.9106 -0.0021 -0.0016 -0.0016 0.3241 5.0101 14.6262 18.0080 32.3054
frequency: 14.3680 17.8420 32.3001 38.1015 45.3488 85.3947 110.3911 126.4170 136.6482 170.1278 213.0360 232.3383 265.2844 283.8201 319.7230 344.7426 362.6360 379.5686 392.5102 411.3551 412.8161 436.6844 470.4981 489.8933 507.5169 545.5320 597.0610 604.1487 619.6096 638.4376 657.9790 682.0868 696.3134 704.4185 736.7920 757.8795 812.4784 816.7824 828.9400 841.4981 873.9462 930.3423 943.6312 958.5115 972.9498 987.1888 996.4179 1030.0047 1041.0130 1067.4049 1069.3311 1102.8434 1154.3852 1166.1656 1182.4789 1207.9114 1246.9143 1255.2102 1284.6470 1295.1623 1365.6274 1372.0176 1386.8477 1397.5078 1423.4318 1465.1745 1492.4488 1577.1237 1588.3834 1599.7850 1624.8129 3157.5108 3161.5607 3166.8600 3178.5697 3179.5867 3182.0888 3185.2506
redmass: 13.7596 9.3452 8.4022 5.6999 14.2300 9.3621 9.9128 10.4126 5.9107 11.2706 11.0245 11.6514 10.0137 8.6905 11.6862 8.0569 7.7726 7.9528 7.9150 6.2864 3.0327 4.8742 7.0433 3.3508 10.2058 6.7398 8.7929 6.1747 7.3050 6.6736 8.1813 6.8524 4.1578 9.2629 6.2435 5.6460 2.1224 2.2710 1.4732 1.4905 7.2671 1.5110 1.3265 1.3552 1.3628 8.4353 4.0507 6.0605 8.6168 3.2196 2.6226 1.3006 1.9518 1.2870 1.6245 9.0342 2.1492 3.0834 1.2810 2.5307 5.7859 8.8535 8.5292 3.5268 5.3759 2.3624 3.1229 8.3693 6.8047 7.6304 6.8581 1.0895 1.0890 1.0893 1.0969 1.0955 1.0943 1.0981
irintensity: 0.6185 1.2522 0.8753 0.1179 0.8337 2.3331 0.0856 2.1477 1.8512 0.5371 0.1085 3.2756 1.6635 0.3433 11.9134 3.3507 1.0360 1.4779 4.9079 3.0910 0.3144 0.9502 3.5469 32.8219 3.0189 12.7740 32.6380 4.8749 8.2396 8.9854 9.8572 4.9669 6.2713 14.6575 11.0834 18.9436 19.2831 24.3029 71.0988 35.0239 0.3599 62.6791 0.3616 0.3727 1.3482 197.8313 76.6050 155.6694 192.0995 71.1550 38.1438 13.3970 34.2634 15.0359 38.5539 273.9763 37.0462 507.7981 18.0107 274.0025 19.4495 107.9847 20.0237 4.7258 9.1459 276.2080 76.5670 32.6511 8.0719 16.7419 134.8350 5.2573 0.3707 1.8641 0.8825 0.9797 8.4769 0.2932
temp: 298.150 k
press: 1.00000 atm
elementType: 17 9 9 9 8 8 8 7 6 6 6 6 6 6 6 6 6 6 6 6 6 1 1 1 1 1 1 1
symmnumber: 1
zpe: 461222.4 jmol-1
zpe.correction: 0.175670 hartree
zpe.thermalcorrener: 0.194018 hartree
zpe.thermalcorrenthalpy: 0.194963 hartree
zpe.thermalcorrgfe: 0.124741 hartree
zpe.sumelectzpe: -1538.008684 hartree
zpe.sumelectthermal: -1537.990336 hartree
zpe.sumelectthermalent: -1537.989392 hartree
zpe.sumelectthermalfe: -1538.059613 hartree
dipole: 3.1700 -3.2783 -0.9868
dipole: 4.6658
quadrupole: -145.5304 -141.7409 -121.1704
quadrupole: 0.5324 -4.0855 -4.0807
quadrupole: -9.3832 -5.5936 14.9768 0.5324 -4.0855 -4.0807
hfenergy: -1538.1843545 hartree
pointgroup: C01[X(C13H7Cl1F3N1O3)]
dipole: 1.1248344 -1.4299281 -0.2443389 debye
polarizability: 270.1444562|-26.0496979|161.5997175|1.4787043|-13.7114725|108.4556628 unknown
InChI: InChI=1S/C13H7ClF3NO3/c14-9-2-4-10(5-3-9)21-12-6-1-8(13(15,16)17)7-11(12)18(19)20/h1-7H
charge 0 multiplicity 1
28 atoms
Cl 6.374612 -1.907185 0.502357
F  -4.399807 -2.204329 -0.820203
F  -4.448342 -1.531627 1.339303
F  -5.144574 -0.12026 -0.291055
O  1.162245 0.939217 -0.508668
O  -1.925853 3.52105 -0.489344
O  0.059778 3.191847 0.58877
N  -0.991882 2.763563 -0.014836
C  -0.099714 0.399293 -0.296101
C  -2.764225 -0.557867 -0.123364
C  -1.192088 1.297712 -0.13685
C  -2.516679 0.825639 -0.070002
C  -0.368493 -0.992795 -0.360602
C  -1.685785 -1.467292 -0.265259
C  -4.162743 -1.084383 0.016249
C  2.346134 0.184582 -0.260063
C  2.53947 -0.513531 0.951966
C  3.362115 0.277582 -1.231859
C  3.774426 -1.15781 1.181882
C  4.599279 -0.362026 -0.999051
C  4.784217 -1.076434 0.201702
H  -3.330928 1.549999 0.018322
H  0.457426 -1.693171 -0.509735
H  -1.881786 -2.541872 -0.329425
H  1.755457 -0.540464 1.714832
H  3.185057 0.848813 -2.147102
H  3.949276 -1.701011 2.114523
H  5.40181 -0.302938 -1.739187
