program: Orca
programVersion: 5.0.2
elementType: O O O O N N C C C C C C C C C C C C C C C C C H H H H H H H H H H H H H H H H H H H H H H
charge: 0
multiplicity: 1
keywords: wb97x-d3
keywords: def2-TZVPP
keywords: def2/J RIJCOSX
keywords: DEFGRID2
keywords: scfconv7
keywords: smallprint printgap noloewdin
keywords: NOSOSCF
formula: C17H22N2O4
InChI: InChI=1/C17H22N2O4/c1-6-7-18-9-13(20)19(16(18)22)10-23-15(21)14-12(8-11(2)3)17(14,4)5/h1,8,12,14H,7,9-10H2,2-5H3
45 atoms
O  0.784142 1.87883 -1.055299
O  1.204292 1.289693 1.058045
O  -1.557262 2.377498 2.028528
O  -1.620191 0.269287 -2.014785
N  -1.366928 1.576081 -0.12275
N  -2.514637 -0.30278 0.029776
C  3.90302 0.169282 0.055113
C  2.928592 -0.884362 -0.34575
C  2.667398 0.589525 -0.71155
C  5.183035 0.249449 -0.745436
C  4.108478 0.539052 1.503857
C  2.06697 -1.615298 0.608654
C  1.516714 1.2714 -0.106449
C  1.107952 -2.468202 0.233575
C  0.289622 -3.214922 1.240182
C  0.771112 -2.72144 -1.210031
C  -0.426705 2.507002 -0.67353
C  -1.785938 1.550217 1.183989
C  -1.830693 0.46731 -0.839013
C  -2.608426 0.296422 1.3345
C  -3.19192 -1.520183 -0.330199
C  -4.630875 -1.335467 -0.508191
C  -5.814555 -1.18056 -0.639396
H  3.20967 -1.460045 -1.223449
H  2.820813 0.8309 -1.756824
H  5.600219 1.258055 -0.714904
H  5.932894 -0.432396 -0.338977
H  5.029885 -0.015036 -1.792795
H  4.435402 1.577007 1.589983
H  3.228715 0.421206 2.128691
H  4.897694 -0.086706 1.925846
H  2.243331 -1.469734 1.669077
H  0.416464 -4.294997 1.124966
H  0.551394 -2.9521 2.26519
H  -0.777429 -3.018134 1.101873
H  0.300488 -1.848945 -1.669854
H  1.654388 -2.952163 -1.809012
H  0.078963 -3.556625 -1.318981
H  -0.261003 3.299779 0.055656
H  -0.817632 2.945415 -1.588276
H  -2.189649 -0.342785 2.115926
H  -3.637026 0.547573 1.608778
H  -3.01316 -2.267365 0.446523
H  -2.749693 -1.914149 -1.246231
H  -6.866436 -1.048293 -0.761196
elementType: O N C H
totalener: -1071.54209639 hartree
nucrepener: 2054.10282604 hartree
electener: -3125.64492243 hartree
oneelecener: -5540.86157435 hartree
twoeener: 2415.21665192 hartree
cpcmener: -0.04287974 hartree
kineticenergy: 1066.86745054 hartree
xcener: -102.624963711736 hartree
chargesum: -0.0000000
charge: -0.282655 -0.456698 -0.441283 -0.485348 -0.123967 -0.135137 0.131288 -0.048043 -0.086486 -0.261580 -0.287968 -0.239565 0.390143 -0.040035 -0.219187 -0.289762 0.082726 0.293866 0.360137 -0.004378 -0.112278 -0.444879 0.126430 0.113490 0.092789 0.095638 0.095059 0.086093 0.100717 0.092696 0.097946 0.125316 0.103166 0.089055 0.085962 0.095379 0.109166 0.098425 0.133083 0.144910 0.123284 0.128746 0.144539 0.134712 0.284485
qa: -0.2827 -0.4567 -0.4413 -0.4853 -0.1240 -0.1351 0.1313 -0.0480 -0.0865 -0.2616 -0.2880 -0.2396 0.3901 -0.0400 -0.2192 -0.2898 0.0827 0.2939 0.3601 -0.0044 -0.1123 -0.4449 0.1264 0.1135 0.0928 0.0956 0.0951 0.0861 0.1007 0.0927 0.0979 0.1253 0.1032 0.0891 0.0860 0.0954 0.1092 0.0984 0.1331 0.1449 0.1233 0.1287 0.1445 0.1347 0.2845
va: 2.1093 2.0385 2.0797 2.0339 3.0957 3.1676 3.7907 3.7945 3.8352 3.8943 3.8873 3.8028 4.1164 3.7093 3.9166 3.9362 3.8983 4.2074 4.3175 3.8808 3.9369 3.8970 3.4895 1.0037 1.0310 1.0027 1.0023 1.0048 1.0001 1.0210 0.9995 1.0035 0.9957 1.0094 0.9924 1.0082 1.0043 1.0034 1.0162 0.9927 1.0074 1.0057 0.9785 1.0017 0.9474
dispcorr: -0.025073125 hartree
energy: -1071.567169515527
dipole: 18.94082 -19.27683 -0.33601 -16.05707 14.61403 -1.44304 1.60914 -1.85694 -0.24780
magnitude: 1.50222 au
magnitude: 3.81834 debye
