program: Orca
programVersion: 5.0.2
elementType: O O O O N N C C C C C C C C C C C C C C C C C H H H H H H H H H H H H H H H H H H H H H H
charge: 0
multiplicity: 1
keywords: wb97x-d3
keywords: def2-TZVPP
keywords: def2/J RIJCOSX
keywords: DEFGRID2
keywords: scfconv7
keywords: smallprint printgap noloewdin
keywords: NOSOSCF
formula: C17H22N2O4
InChI: InChI=1/C17H22N2O4/c1-6-7-18-9-13(20)19(16(18)22)10-23-15(21)14-12(8-11(2)3)17(14,4)5/h1,8,12,14H,7,9-10H2,2-5H3
45 atoms
O  0.456543 0.900647 -0.535318
O  1.992353 1.314129 1.039381
O  -1.625795 -0.131606 1.858263
O  -2.503646 2.18855 -1.962872
N  -1.764909 1.212927 0.004042
N  -3.793087 0.740346 -0.719545
C  3.928855 -0.27263 -0.814204
C  3.315356 -1.28921 0.082113
C  2.415532 -0.30805 -0.678765
C  4.444508 -0.753433 -2.150764
C  4.738239 0.870976 -0.255412
C  3.448389 -1.252199 1.559184
C  1.650145 0.711127 0.052287
C  2.606535 -1.845915 2.408859
C  2.819235 -1.787418 3.890159
C  1.375005 -2.575595 1.968623
C  -0.466271 1.7987 0.061594
C  -2.228518 0.289388 0.902762
C  -2.691295 1.456081 -1.019103
C  -3.618977 -0.075042 0.45388
C  -4.980232 0.706089 -1.532986
C  -5.096462 -0.526119 -2.310079
C  -5.193194 -1.542742 -2.941769
H  3.249912 -2.289735 -0.337681
H  1.885773 -0.728148 -1.525598
H  5.474874 -1.103882 -2.060189
H  3.84893 -1.577381 -2.546292
H  4.431719 0.051029 -2.888965
H  5.784842 0.570192 -0.174117
H  4.698289 1.730321 -0.927538
H  4.418314 1.206692 0.726851
H  4.301878 -0.71848 1.966321
H  3.691092 -1.190731 4.158558
H  1.948763 -1.356934 4.392518
H  2.95275 -2.788307 4.309372
H  1.348267 -2.770952 0.897824
H  1.279461 -3.532881 2.486427
H  0.480191 -1.999202 2.218819
H  -0.212113 2.00616 1.099157
H  -0.471069 2.734102 -0.495566
H  -3.677812 -1.144573 0.233094
H  -4.349159 0.156533 1.233424
H  -4.975108 1.567836 -2.201058
H  -5.856652 0.816127 -0.890129
H  -5.289824 -2.445845 -3.50202
elementType: O N C H
totalener: -1071.54464460 hartree
nucrepener: 1949.93856384 hartree
electener: -3021.48320844 hartree
oneelecener: -5332.81667778 hartree
twoeener: 2311.33346934 hartree
cpcmener: -0.04143738 hartree
kineticenergy: 1066.87223243 hartree
xcener: -102.624995182039 hartree
chargesum: -0.0000000
charge: -0.283785 -0.455875 -0.456937 -0.486633 -0.117797 -0.153187 0.136015 -0.031376 -0.101656 -0.261922 -0.298340 -0.261423 0.399113 -0.012115 -0.227271 -0.273492 0.068748 0.305399 0.384106 0.011532 -0.061079 -0.424949 0.067021 0.110294 0.092587 0.094120 0.086614 0.095898 0.099593 0.100591 0.094358 0.121358 0.088310 0.094530 0.094942 0.092114 0.103274 0.098852 0.133969 0.132528 0.125463 0.121758 0.130459 0.141064 0.283226
qa: -0.2838 -0.4559 -0.4569 -0.4866 -0.1178 -0.1532 0.1360 -0.0314 -0.1017 -0.2619 -0.2983 -0.2614 0.3991 -0.0121 -0.2273 -0.2735 0.0687 0.3054 0.3841 0.0115 -0.0611 -0.4249 0.0670 0.1103 0.0926 0.0941 0.0866 0.0959 0.0996 0.1006 0.0944 0.1214 0.0883 0.0945 0.0949 0.0921 0.1033 0.0989 0.1340 0.1325 0.1255 0.1218 0.1305 0.1411 0.2832
va: 2.1045 2.0361 2.0512 2.0393 3.1288 3.1955 3.7483 3.8227 3.8462 3.8984 3.8982 3.8458 4.0886 3.7102 3.9295 3.9462 3.8822 4.1720 4.3145 3.8981 3.9013 3.7404 3.5700 1.0054 1.0305 1.0022 1.0045 1.0025 0.9983 1.0002 1.0165 1.0008 1.0074 0.9957 0.9968 1.0054 1.0015 1.0040 1.0187 1.0077 1.0063 1.0067 1.0065 0.9852 0.9482
dispcorr: -0.021459343 hartree
energy: -1071.566103943713
dipole: 23.48823 -25.17538 -1.68715 -12.33063 11.23838 -1.09225 5.87781 -6.35050 -0.47269
magnitude: 2.06468 au
magnitude: 5.24801 debye
