program: Orca
programVersion: 5.0.2
elementType: O O O O N N C C C C C C C C C C C C C C C C C H H H H H H H H H H H H H H H H H H H H H H
charge: 0
multiplicity: 1
keywords: wb97x-d3
keywords: def2-TZVPP
keywords: def2/J RIJCOSX
keywords: DEFGRID2
keywords: scfconv7
keywords: smallprint printgap noloewdin
keywords: NOSOSCF
formula: C17H22N2O4
InChI: InChI=1/C17H22N2O4/c1-6-7-18-9-13(20)19(16(18)22)10-23-15(21)14-12(8-11(2)3)17(14,4)5/h1,8,12,14H,7,9-10H2,2-5H3
45 atoms
O  0.471776 1.009876 -0.559213
O  1.968699 1.307896 1.080412
O  -1.599549 0.076039 1.946626
O  -2.477202 2.144625 -2.015339
N  -1.744611 1.307113 0.015081
N  -3.759127 0.758253 -0.695817
C  3.904966 -0.264089 -0.800184
C  3.248349 -1.291978 0.051772
C  2.389422 -0.260277 -0.688073
C  4.427019 -0.711085 -2.145851
C  4.736114 0.834986 -0.187448
C  3.369899 -1.310765 1.530457
C  1.637312 0.755982 0.060788
C  2.497133 -1.892862 2.356639
C  2.709852 -1.900262 3.839139
C  1.234673 -2.54858 1.890292
C  -0.451318 1.908511 0.034451
C  -2.198533 0.425997 0.960453
C  -2.664057 1.470339 -1.029196
C  -3.572956 0.000347 0.514199
C  -4.910558 0.609346 -1.547376
C  -4.922509 -0.667237 -2.25925
C  -4.949054 -1.722502 -2.832414
H  3.159392 -2.275223 -0.403056
H  1.864286 -0.637335 -1.55773
H  3.822707 -1.512979 -2.572336
H  4.433723 0.116014 -2.858714
H  5.451011 -1.080209 -2.056588
H  4.407416 1.144864 0.800571
H  5.772038 0.500863 -0.09828
H  4.733413 1.718193 -0.829181
H  4.247701 -0.836693 1.959475
H  3.629387 -1.389721 4.126346
H  1.878265 -1.412007 4.354908
H  2.755812 -2.921877 4.226429
H  1.158191 -2.617517 0.806301
H  1.145688 -3.559265 2.297303
H  0.361908 -1.995263 2.248179
H  -0.18127 2.146815 1.061143
H  -0.47593 2.827532 -0.548311
H  -3.59299 -1.079387 0.337516
H  -4.320174 0.238909 1.274997
H  -4.931684 1.434896 -2.259525
H  -5.815418 0.698457 -0.941902
H  -4.95458 -2.651679 -3.357527
elementType: O N C H
totalener: -1071.54465205 hartree
nucrepener: 1956.25253962 hartree
electener: -3027.79719167 hartree
oneelecener: -5345.46602637 hartree
twoeener: 2317.66883470 hartree
cpcmener: -0.04184549 hartree
kineticenergy: 1066.86756503 hartree
xcener: -102.623830582392 hartree
chargesum: -0.0000000
charge: -0.282339 -0.453887 -0.455191 -0.486184 -0.117885 -0.156283 0.139821 -0.029143 -0.111780 -0.262160 -0.299173 -0.263158 0.400373 -0.013745 -0.226007 -0.270182 0.071871 0.305482 0.385089 0.007584 -0.060446 -0.427164 0.069068 0.111459 0.094462 0.086411 0.096273 0.093758 0.094408 0.099737 0.100511 0.120789 0.088550 0.094814 0.093917 0.090648 0.104802 0.095649 0.132874 0.132121 0.126059 0.121887 0.132216 0.140538 0.283561
qa: -0.2823 -0.4539 -0.4552 -0.4862 -0.1179 -0.1563 0.1398 -0.0291 -0.1118 -0.2622 -0.2992 -0.2632 0.4004 -0.0137 -0.2260 -0.2702 0.0719 0.3055 0.3851 0.0076 -0.0604 -0.4272 0.0691 0.1115 0.0945 0.0864 0.0963 0.0938 0.0944 0.0997 0.1005 0.1208 0.0886 0.0948 0.0939 0.0906 0.1048 0.0956 0.1329 0.1321 0.1261 0.1219 0.1322 0.1405 0.2836
va: 2.1061 2.0400 2.0524 2.0393 3.1283 3.1924 3.7398 3.8234 3.8391 3.8988 3.8994 3.8506 4.0959 3.7110 3.9277 3.9440 3.8818 4.1731 4.3150 3.8982 3.8982 3.7431 3.5711 1.0052 1.0301 1.0045 1.0024 1.0023 1.0159 0.9982 1.0003 1.0005 1.0073 0.9961 0.9968 1.0062 1.0010 1.0049 1.0220 1.0072 1.0056 1.0068 1.0051 0.9854 0.9478
dispcorr: -0.021590777 hartree
energy: -1071.566242831378
dipole: 23.01727 -24.66610 -1.64883 -12.86635 11.75470 -1.11165 5.59324 -6.12218 -0.52894
magnitude: 2.05771 au
magnitude: 5.23028 debye
