program: Orca
programVersion: 5.0.2
elementType: O O O O N N C C C C C C C C C C C C C C C C C H H H H H H H H H H H H H H H H H H H H H H
charge: 0
multiplicity: 1
keywords: wb97x-d3
keywords: def2-TZVPP
keywords: def2/J RIJCOSX
keywords: DEFGRID2
keywords: scfconv7
keywords: smallprint printgap noloewdin
keywords: NOSOSCF
formula: C17H22N2O4
InChI: InChI=1/C17H22N2O4/c1-6-7-18-9-13(20)19(16(18)22)10-23-15(21)14-12(8-11(2)3)17(14,4)5/h1,8,12,14H,7,9-10H2,2-5H3
45 atoms
O  1.00082 1.150087 -0.330187
O  2.2556 2.144513 -1.876864
O  -1.021781 2.029212 2.147402
O  -1.987446 0.412356 -2.00128
N  -1.251812 1.436089 -0.05947
N  -3.095573 0.228141 0.011624
C  3.693223 0.067605 0.714707
C  2.962241 -1.020901 0.006562
C  3.175862 0.318682 -0.695298
C  5.194826 -0.054442 0.821501
C  3.079596 0.76649 1.903308
C  1.64015 -1.526069 0.457287
C  2.122142 1.291397 -1.029159
C  0.743151 -2.127917 -0.325534
C  -0.558787 -2.633778 0.216314
C  0.924963 -2.299636 -1.801646
C  -0.076784 2.037149 -0.594122
C  -1.61575 1.468624 1.261114
C  -2.121374 0.642244 -0.820687
C  -2.889738 0.671312 1.36529
C  -4.212927 -0.587498 -0.389855
C  -4.229761 -1.876846 0.296129
C  -4.246181 -2.924098 0.883885
H  3.603628 -1.787698 -0.421684
H  3.946136 0.319188 -1.458242
H  5.624387 -0.568477 -0.039361
H  5.666324 0.927914 0.89158
H  5.470645 -0.618863 1.714826
H  3.457872 1.787598 1.983401
H  1.994263 0.819397 1.885486
H  3.361814 0.24358 2.819663
H  1.408498 -1.414426 1.512811
H  -1.39797 -2.232866 -0.356158
H  -0.628304 -3.721786 0.129542
H  -0.70366 -2.371635 1.264641
H  0.723218 -3.329602 -2.106166
H  0.20962 -1.673282 -2.342686
H  1.92307 -2.038077 -2.149231
H  0.096749 2.997849 -0.109443
H  -0.214023 2.196601 -1.662087
H  -2.762379 -0.160603 2.063207
H  -3.70796 1.300652 1.726205
H  -4.164281 -0.737782 -1.468374
H  -5.148062 -0.058226 -0.1882
H  -4.264945 -3.858831 1.39756
elementType: O N C H
totalener: -1071.54195754 hartree
nucrepener: 2059.28370186 hartree
electener: -3130.82565940 hartree
oneelecener: -5550.71579969 hartree
twoeener: 2419.89014030 hartree
cpcmener: -0.04059767 hartree
kineticenergy: 1066.87693457 hartree
xcener: -102.627731010202 hartree
chargesum: -0.0000000
charge: -0.248862 -0.468243 -0.448205 -0.486223 -0.100960 -0.126918 0.137085 -0.025416 -0.158063 -0.267013 -0.284872 -0.237449 0.429706 -0.026014 -0.243380 -0.266274 0.053080 0.289870 0.345900 -0.003635 -0.047693 -0.450606 0.076524 0.113455 0.093918 0.086479 0.096173 0.092647 0.103134 0.080267 0.099599 0.121493 0.074714 0.113603 0.096582 0.104975 0.093465 0.092737 0.145111 0.127201 0.128937 0.131013 0.132910 0.144071 0.285181
qa: -0.2489 -0.4682 -0.4482 -0.4862 -0.1010 -0.1269 0.1371 -0.0254 -0.1581 -0.2670 -0.2849 -0.2374 0.4297 -0.0260 -0.2434 -0.2663 0.0531 0.2899 0.3459 -0.0036 -0.0477 -0.4506 0.0765 0.1135 0.0939 0.0865 0.0962 0.0926 0.1031 0.0803 0.0996 0.1215 0.0747 0.1136 0.0966 0.1050 0.0935 0.0927 0.1451 0.1272 0.1289 0.1310 0.1329 0.1441 0.2852
va: 2.0992 2.0378 2.0645 2.0253 3.1380 3.1817 3.7353 3.7958 3.8887 3.9070 3.9103 3.8283 4.1028 3.7150 3.9257 3.9445 3.9044 4.1886 4.3071 3.8938 3.8722 3.7409 3.5499 1.0045 1.0281 1.0053 1.0017 1.0022 1.0011 1.0135 0.9994 0.9991 0.9964 0.9977 1.0037 0.9997 1.0085 1.0053 0.9958 1.0175 1.0071 1.0069 1.0101 0.9846 0.9479
dispcorr: -0.026465709 hartree
energy: -1071.568423244443
dipole: 13.53081 -15.18430 -1.65350 -13.50605 12.20958 -1.29648 4.82350 -3.46203 1.36147
magnitude: 2.50370 au
magnitude: 6.36389 debye
