program: Orca
programVersion: 5.0.2
elementType: O O O O N N C C C C C C C C C C C C C C C C C H H H H H H H H H H H H H H H H H H H H H H
charge: 0
multiplicity: 1
keywords: wb97x-d3
keywords: def2-TZVPP
keywords: def2/J RIJCOSX
keywords: DEFGRID2
keywords: scfconv7
keywords: smallprint printgap noloewdin
keywords: NOSOSCF
formula: C17H22N2O4
InChI: InChI=1/C17H22N2O4/c1-6-7-18-9-13(20)19(16(18)22)10-23-15(21)14-12(8-11(2)3)17(14,4)5/h1,8,12,14H,7,9-10H2,2-5H3
45 atoms
O  1.021474 1.177613 -0.270385
O  2.15785 2.084612 -1.960817
O  -1.081733 1.851194 2.247506
O  -1.918026 0.582563 -2.045892
N  -1.243902 1.443725 -0.005642
N  -3.101351 0.257053 -0.095049
C  3.811812 0.058635 0.505901
C  2.950327 -1.035884 -0.024935
C  3.115939 0.24786 -0.834279
C  5.308498 -0.124974 0.422286
C  3.386804 0.857013 1.714232
C  1.689196 -1.451466 0.638752
C  2.069792 1.253532 -1.086233
C  0.695218 -2.122702 0.054038
C  -0.532718 -2.511489 0.818333
C  0.681664 -2.479857 -1.399621
C  -0.054017 2.087234 -0.452262
C  -1.651962 1.372288 1.300178
C  -2.093344 0.723439 -0.857145
C  -2.939525 0.589286 1.295994
C  -4.216418 -0.501587 -0.600279
C  -4.254032 -1.8590 -0.062229
C  -4.290602 -2.966786 0.399854
H  3.497499 -1.855498 -0.484243
H  3.776991 0.170072 -1.690036
H  5.680313 -0.653203 1.302953
H  5.600011 -0.702021 -0.456433
H  5.820912 0.838006 0.372779
H  3.82036 1.85846 1.680434
H  2.310899 0.968122 1.824413
H  3.756142 0.373439 2.621116
H  1.587742 -1.204805 1.691739
H  -1.426899 -2.085376 0.357838
H  -0.677759 -3.595501 0.815048
H  -0.49455 -2.180405 1.856477
H  0.459375 -3.540563 -1.541217
H  -0.1070 -1.928467 -1.92023
H  1.621406 -2.264799 -1.906039
H  0.118319 2.985027 0.140773
H  -0.172252 2.368418 -1.49668
H  -2.849236 -0.296659 1.930464
H  -3.761859 1.201916 1.67589
H  -4.151368 -0.533803 -1.688238
H  -5.150516 0.011352 -0.356222
H  -4.319837 -3.954586 0.802686
elementType: O N C H
totalener: -1071.54151072 hartree
nucrepener: 2057.00805017 hartree
electener: -3128.54956088 hartree
oneelecener: -5546.13781775 hartree
twoeener: 2417.58825686 hartree
cpcmener: -0.04113696 hartree
kineticenergy: 1066.87648443 hartree
xcener: -102.627843209031 hartree
chargesum: -0.0000000
charge: -0.250492 -0.465637 -0.449243 -0.485427 -0.104265 -0.133872 0.136692 -0.027000 -0.160445 -0.266854 -0.287388 -0.222205 0.431469 -0.046371 -0.208545 -0.263020 0.055995 0.294755 0.363357 -0.019550 -0.044938 -0.430572 0.062827 0.112577 0.094024 0.093468 0.086247 0.095767 0.102962 0.082203 0.100479 0.122299 0.045047 0.109549 0.094035 0.103024 0.092735 0.092622 0.142175 0.128859 0.131836 0.134800 0.129289 0.142212 0.284520
qa: -0.2505 -0.4656 -0.4492 -0.4854 -0.1043 -0.1339 0.1367 -0.0270 -0.1604 -0.2669 -0.2874 -0.2222 0.4315 -0.0464 -0.2085 -0.2630 0.0560 0.2948 0.3634 -0.0195 -0.0449 -0.4306 0.0628 0.1126 0.0940 0.0935 0.0862 0.0958 0.1030 0.0822 0.1005 0.1223 0.0450 0.1095 0.0940 0.1030 0.0927 0.0926 0.1422 0.1289 0.1318 0.1348 0.1293 0.1422 0.2845
va: 2.0948 2.0407 2.0629 2.0298 3.1313 3.1830 3.7481 3.7937 3.8847 3.9059 3.9056 3.8252 4.1120 3.7115 3.9269 3.9409 3.8853 4.1687 4.2937 3.9072 3.8854 3.7236 3.5721 1.0038 1.0286 1.0018 1.0055 1.0018 1.0010 1.0167 0.9987 0.9997 1.0003 1.0010 1.0082 1.0001 1.0075 1.0057 0.9990 1.0227 1.0028 1.0086 1.0103 0.9841 0.9484
dispcorr: -0.026267909 hartree
energy: -1071.567778624808
dipole: 13.91403 -15.53601 -1.62198 -13.47415 12.22695 -1.24720 5.56998 -4.24399 1.32598
magnitude: 2.43814 au
magnitude: 6.19727 debye
