program: Orca
programVersion: 5.0.2
elementType: O O O O N N C C C C C C C C C C C C C C C C C H H H H H H H H H H H H H H H H H H H H H H
charge: 0
multiplicity: 1
keywords: wb97x-d3
keywords: def2-TZVPP
keywords: def2/J RIJCOSX
keywords: DEFGRID2
keywords: scfconv7
keywords: smallprint printgap noloewdin
keywords: NOSOSCF
formula: C17H22N2O4
InChI: InChI=1/C17H22N2O4/c1-6-7-18-9-13(20)19(16(18)22)10-23-15(21)14-12(8-11(2)3)17(14,4)5/h1,8,12,14H,7,9-10H2,2-5H3
45 atoms
O  0.872999 1.202836 -0.397783
O  2.081566 2.869105 -1.2426
O  -1.300016 2.248564 2.028312
O  -1.829895 -0.33524 -1.686574
N  -1.371645 1.196506 -0.01318
N  -2.807259 -0.428083 0.399105
C  3.364449 0.02763 0.768357
C  3.281401 -0.543982 -0.610918
C  3.217641 0.966962 -0.419289
C  4.730672 0.065656 1.415732
C  2.254042 -0.172075 1.773956
C  2.122539 -1.308395 -1.144836
C  2.026126 1.776286 -0.725852
C  1.716976 -2.507019 -0.719321
C  0.552687 -3.199838 -1.360977
C  2.363916 -3.260853 0.401035
C  -0.330463 1.906229 -0.674208
C  -1.740299 1.403267 1.291968
C  -2.005321 0.074407 -0.561792
C  -2.794451 0.372467 1.597131
C  -3.780158 -1.465065 0.167539
C  -5.127572 -0.923534 -0.0032
C  -6.226666 -0.451607 -0.111377
H  4.238113 -0.850868 -1.029316
H  4.119074 1.50322 -0.692437
H  4.786275 0.862571 2.160489
H  4.940667 -0.877509 1.92518
H  5.527296 0.234169 0.689594
H  2.554373 -0.942935 2.486041
H  2.071609 0.739105 2.347449
H  1.313423 -0.489836 1.333873
H  1.601234 -0.869982 -1.991142
H  0.847181 -4.168624 -1.773007
H  -0.232375 -3.402807 -0.626969
H  0.11433 -2.610504 -2.165989
H  1.653942 -3.447401 1.210867
H  2.695918 -4.243423 0.053878
H  3.229138 -2.750522 0.820576
H  -0.294169 2.925788 -0.2930
H  -0.525749 1.931586 -1.745881
H  -2.522346 -0.207899 2.481636
H  -3.755624 0.86085 1.7866
H  -3.769049 -2.161141 1.009164
H  -3.486663 -2.036821 -0.713468
H  -7.206362 -0.046047 -0.233893
elementType: O N C H
totalener: -1071.54203434 hartree
nucrepener: 2025.41854106 hartree
electener: -3096.96057539 hartree
oneelecener: -5482.81045641 hartree
twoeener: 2385.84988102 hartree
cpcmener: -0.04127157 hartree
kineticenergy: 1066.86639066 hartree
xcener: -102.623461508741 hartree
chargesum: -0.0000000
charge: -0.251266 -0.467666 -0.444939 -0.485331 -0.121187 -0.150426 0.083636 0.004867 -0.089563 -0.270895 -0.288169 -0.265767 0.391477 -0.016324 -0.245246 -0.258370 0.062150 0.291857 0.380270 0.001459 -0.050623 -0.427036 0.064275 0.112261 0.092982 0.099675 0.090339 0.087539 0.096616 0.114785 0.088605 0.111578 0.106107 0.092561 0.087668 0.099178 0.107130 0.089553 0.130588 0.141571 0.122749 0.126793 0.139946 0.131100 0.283495
qa: -0.2513 -0.4677 -0.4449 -0.4853 -0.1212 -0.1504 0.0836 0.0049 -0.0896 -0.2709 -0.2882 -0.2658 0.3915 -0.0163 -0.2452 -0.2584 0.0621 0.2919 0.3803 0.0015 -0.0506 -0.4270 0.0643 0.1123 0.0930 0.0997 0.0903 0.0875 0.0966 0.1148 0.0886 0.1116 0.1061 0.0926 0.0877 0.0992 0.1071 0.0896 0.1306 0.1416 0.1227 0.1268 0.1399 0.1311 0.2835
va: 2.1006 2.0401 2.0690 2.0314 3.1602 3.1890 3.6851 3.7899 3.8625 3.9141 3.8824 3.8624 4.1385 3.6613 3.9242 3.9371 3.9062 4.1871 4.2944 3.8978 3.9088 3.7605 3.5724 1.0059 1.0261 1.0000 1.0035 1.0057 0.9997 1.0049 1.0065 1.0199 0.9986 0.9953 1.0132 0.9963 1.0006 1.0053 1.0080 1.0013 1.0094 1.0043 0.9857 1.0055 0.9483
dispcorr: -0.024659335 hartree
energy: -1071.566693671187
dipole: 16.75170 -17.91952 -1.16783 -18.67507 16.47428 -2.20079 6.27928 -4.78149 1.49779
magnitude: 2.90701 au
magnitude: 7.38903 debye
