program: Orca
programVersion: 5.0.2
elementType: O O O O N N C C C C C C C C C C C C C C C C C H H H H H H H H H H H H H H H H H H H H H H
charge: 0
multiplicity: 1
keywords: wb97x-d3
keywords: def2-TZVPP
keywords: def2/J RIJCOSX
keywords: DEFGRID2
keywords: scfconv7
keywords: smallprint printgap noloewdin
keywords: NOSOSCF
formula: C17H22N2O4
InChI: InChI=1/C17H22N2O4/c1-6-7-18-9-13(20)19(16(18)22)10-23-15(21)14-12(8-11(2)3)17(14,4)5/h1,8,12,14H,7,9-10H2,2-5H3
45 atoms
O  0.342403 0.554249 -0.199614
O  2.081413 1.456445 0.864437
O  -2.060937 -0.589723 1.962623
O  -2.27685 2.253474 -1.595332
N  -1.852401 0.978255 0.289771
N  -3.807219 0.766897 -0.722348
C  3.913853 -0.298031 -0.895717
C  3.337393 -1.30052 0.046039
C  2.41557 -0.335564 -0.706701
C  4.387815 -0.816796 -2.234635
C  4.753764 0.848397 -0.385893
C  3.505017 -1.212569 1.518031
C  1.655015 0.66209 0.070913
C  2.6194 -1.663895 2.407077
C  2.868557 -1.556519 3.880072
C  1.310922 -2.285893 2.02574
C  -0.516811 1.412348 0.529506
C  -2.486018 -0.011827 1.001813
C  -2.619102 1.427439 -0.794123
C  -3.829636 -0.210531 0.329431
C  -4.812999 0.85414 -1.746587
C  -4.937471 -0.383469 -2.512912
C  -5.042705 -1.412823 -3.119623
H  3.277542 -2.315298 -0.33982
H  1.845942 -0.777911 -1.516116
H  3.779758 -1.649798 -2.590479
H  4.351296 -0.032308 -2.992394
H  5.419225 -1.167576 -2.167088
H  4.459262 1.204244 0.59598
H  5.799027 0.536257 -0.337869
H  4.696297 1.695435 -1.071073
H  4.42067 -0.758936 1.883185
H  3.822172 -1.079471 4.1019
H  2.080637 -0.974731 4.364487
H  2.864853 -2.54151 4.353455
H  1.179784 -2.384098 0.950139
H  1.21397 -3.281004 2.467104
H  0.472631 -1.697381 2.406394
H  -0.312099 1.358229 1.598529
H  -0.411596 2.443985 0.193582
H  -3.912008 -1.233714 -0.050784
H  -4.642589 -0.04791 1.042682
H  -4.546227 1.680122 -2.407237
H  -5.780019 1.103492 -1.299776
H  -5.132917 -2.317862 -3.671082
totalener: -1071.51628361 hartree
nucrepener: 1956.58828007 hartree
electener: -3028.10456367 hartree
oneelecener: -5345.37856123 hartree
twoeener: 2317.27399755 hartree
kineticenergy: 1066.94241299 hartree
xcener: -102.627472385325 hartree
chargesum: 0.0000000
charge: -0.262632 -0.372281 -0.356727 -0.378407 -0.142687 -0.172481 0.143075 -0.054803 -0.101280 -0.245517 -0.274702 -0.196796 0.329173 0.003742 -0.206912 -0.251835 0.070856 0.244349 0.341635 -0.017959 -0.085206 -0.400108 0.104305 0.092839 0.083636 0.069972 0.091876 0.087810 0.104539 0.085680 0.087302 0.084446 0.077564 0.089134 0.082499 0.078852 0.092662 0.098939 0.128213 0.130911 0.110542 0.103040 0.130664 0.123768 0.248310
qa: -0.2626 -0.3723 -0.3567 -0.3784 -0.1427 -0.1725 0.1431 -0.0548 -0.1013 -0.2455 -0.2747 -0.1968 0.3292 0.0037 -0.2069 -0.2518 0.0709 0.2443 0.3416 -0.0180 -0.0852 -0.4001 0.1043 0.0928 0.0836 0.0700 0.0919 0.0878 0.1045 0.0857 0.0873 0.0844 0.0776 0.0891 0.0825 0.0789 0.0927 0.0989 0.1282 0.1309 0.1105 0.1030 0.1307 0.1238 0.2483
va: 2.0949 2.1112 2.1574 2.1470 3.1251 3.1400 3.7367 3.9001 3.8392 3.9058 3.9080 3.8932 4.1676 3.7426 3.9402 3.9471 3.9159 4.2268 4.3411 3.8968 3.9089 3.7815 3.6348 1.0065 1.0297 1.0069 1.0049 1.0049 1.0184 0.9978 1.0054 1.0134 1.0107 0.9995 0.9989 1.0096 1.0029 1.0107 1.0024 1.0048 1.0113 1.0086 1.0114 0.9834 0.9708
dispcorr: -0.022034193 hartree
energy: -1071.538317800615
dipole: 23.76076 -24.96035 -1.19959 -11.11920 10.30412 -0.81508 4.60326 -5.05774 -0.45448
magnitude: 1.51984 au
magnitude: 3.86313 debye
