program: Orca
programVersion: 5.0.2
elementType: O O O O N N C C C C C C C C C C C C C C C C C H H H H H H H H H H H H H H H H H H H H H H
charge: 0
multiplicity: 1
keywords: wb97x-d3
keywords: def2-TZVPP
keywords: def2/J RIJCOSX
keywords: DEFGRID2
keywords: scfconv7
keywords: smallprint printgap noloewdin
keywords: NOSOSCF
formula: C17H22N2O4
InChI: InChI=1/C17H22N2O4/c1-6-7-18-9-13(20)19(16(18)22)10-23-15(21)14-12(8-11(2)3)17(14,4)5/h1,8,12,14H,7,9-10H2,2-5H3
45 atoms
O  0.872307 1.324547 -0.218628
O  2.092338 2.918125 -1.180517
O  -1.550934 2.198719 2.159994
O  -1.653479 -0.09501 -1.777982
N  -1.388009 1.307091 0.044233
N  -2.7635 -0.416715 0.216602
C  3.435933 0.023097 0.6998
C  3.141573 -0.570918 -0.642925
C  3.188931 0.940757 -0.48391
C  4.87177 -0.015208 1.171403
C  2.447467 -0.099737 1.834714
C  1.891001 -1.303152 -0.977324
C  2.024801 1.833674 -0.66562
C  1.5691 -2.509755 -0.509635
C  0.308909 -3.197024 -0.94419
C  2.413124 -3.281678 0.458021
C  -0.303083 2.076394 -0.465568
C  -1.870854 1.396853 1.330122
C  -1.917458 0.209592 -0.645388
C  -2.891728 0.284501 1.464164
C  -3.651091 -1.473266 -0.18975
C  -5.043956 -1.036206 -0.249836
C  -6.18245 -0.660364 -0.271442
H  4.015293 -0.947114 -1.171693
H  4.076706 1.416757 -0.883232
H  5.07447 0.794157 1.874705
H  5.084474 -0.957676 1.680615
H  5.577539 0.079201 0.34527
H  2.746133 -0.92643 2.481975
H  2.43885 0.804619 2.445149
H  1.43302 -0.29652 1.503668
H  1.220869 -0.842615 -1.694677
H  0.527694 -4.147302 -1.437535
H  -0.321043 -3.434549 -0.082255
H  -0.273923 -2.584285 -1.630158
H  1.858593 -3.497887 1.374729
H  2.695032 -4.248458 0.033033
H  3.327782 -2.761454 0.73498
H  -0.27699 3.036807 0.048407
H  -0.441532 2.239969 -1.534073
H  -2.658795 -0.343472 2.328121
H  -3.892908 0.703583 1.609018
H  -3.562987 -2.316965 0.500821
H  -3.324555 -1.829236 -1.167707
H  -7.192695 -0.330149 -0.304876
totalener: -1071.51347263 hartree
nucrepener: 2027.51849170 hartree
electener: -3099.03196433 hartree
oneelecener: -5486.67366574 hartree
twoeener: 2387.64170141 hartree
kineticenergy: 1066.94345129 hartree
xcener: -102.628021128795 hartree
chargesum: -0.0000000
charge: -0.257709 -0.358965 -0.336559 -0.389106 -0.137564 -0.153081 0.058232 -0.013687 -0.075143 -0.245385 -0.248613 -0.196410 0.314386 -0.020087 -0.230265 -0.247429 0.068431 0.225917 0.333076 -0.025541 -0.098531 -0.410952 0.127227 0.100902 0.087648 0.097403 0.079765 0.074516 0.081017 0.110891 0.082392 0.097450 0.096189 0.072701 0.089478 0.088100 0.098242 0.080830 0.129014 0.131906 0.103632 0.111301 0.124537 0.129985 0.249858
qa: -0.2577 -0.3590 -0.3366 -0.3891 -0.1376 -0.1531 0.0582 -0.0137 -0.0751 -0.2454 -0.2486 -0.1964 0.3144 -0.0201 -0.2303 -0.2474 0.0684 0.2259 0.3331 -0.0255 -0.0985 -0.4110 0.1272 0.1009 0.0876 0.0974 0.0798 0.0745 0.0810 0.1109 0.0824 0.0974 0.0962 0.0727 0.0895 0.0881 0.0982 0.0808 0.1290 0.1319 0.1036 0.1113 0.1245 0.1300 0.2499
va: 2.0853 2.1495 2.1779 2.1264 3.1408 3.1223 3.7121 3.8057 3.8473 3.9183 3.8948 3.8826 4.2390 3.7008 3.9331 3.9412 3.9208 4.2475 4.3227 3.8965 3.9316 3.8377 3.6034 1.0061 1.0269 1.0029 1.0064 1.0088 1.0009 1.0061 1.0141 1.0316 1.0007 0.9970 1.0176 0.9987 1.0035 1.0098 1.0051 1.0018 1.0102 1.0088 0.9831 1.0084 0.9700
dispcorr: -0.024975234 hartree
energy: -1071.538447864988
dipole: 17.14557 -17.98758 -0.84201 -19.34097 17.75240 -1.58857 6.24986 -5.45560 0.79427
magnitude: 1.96555 au
magnitude: 4.99604 debye
