program: Orca
programVersion: 5.0.2
elementType: O O O O N N C C C C C C C C C C C C C C C C C H H H H H H H H H H H H H H H H H H H H H H
charge: 0
multiplicity: 1
keywords: wb97x-d3
keywords: def2-TZVPP
keywords: def2/J RIJCOSX
keywords: DEFGRID2
keywords: scfconv7
keywords: smallprint printgap noloewdin
keywords: NOSOSCF
formula: C17H22N2O4
InChI: InChI=1/C17H22N2O4/c1-6-7-18-9-13(20)19(16(18)22)10-23-15(21)14-12(8-11(2)3)17(14,4)5/h1,8,12,14H,7,9-10H2,2-5H3
45 atoms
O  0.954837 1.303427 -0.516069
O  2.089481 2.605231 -1.923793
O  -1.260372 2.271247 1.983386
O  -1.707212 -0.10304 -1.883659
N  -1.287057 1.342936 -0.123478
N  -2.69558 -0.333852 0.184909
C  3.609211 0.090782 0.289122
C  3.020335 -0.78869 -0.769842
C  3.177163 0.700394 -1.033318
C  5.106599 0.019765 0.486103
C  2.867986 0.385778 1.571684
C  1.68944 -1.446266 -0.685091
C  2.046859 1.637413 -1.212235
C  1.349525 -2.388817 0.194443
C  -0.016878 -3.00745 0.166241
C  2.264421 -2.911058 1.259621
C  -0.219521 2.066242 -0.730494
C  -1.662363 1.463867 1.195691
C  -1.890228 0.241935 -0.746078
C  -2.68847 0.373554 1.434566
C  -3.57535 -1.434159 -0.102609
C  -4.982252 -1.069293 0.041711
C  -6.131174 -0.759578 0.191802
H  3.750563 -1.373809 -1.326087
H  3.989307 0.974859 -1.696204
H  5.493399 0.95715 0.889113
H  5.364099 -0.774602 1.19009
H  5.634273 -0.183103 -0.446655
H  1.79717 0.224549 1.501392
H  3.246231 -0.2611 2.365047
H  3.037482 1.416355 1.887954
H  0.959868 -1.168905 -1.438444
H  -0.627154 -2.602678 -0.640333
H  0.039876 -4.090931 0.035935
H  -0.540658 -2.836886 1.11187
H  2.346607 -3.998774 1.192429
H  3.269072 -2.4991 1.194385
H  1.87423 -2.691106 2.256802
H  -0.142408 3.047051 -0.261706
H  -0.419646 2.186847 -1.794613
H  -2.382019 -0.256652 2.274354
H  -3.662537 0.80977 1.676709
H  -3.349015 -2.277909 0.556977
H  -3.37407 -1.766043 -1.122173
H  -7.15223 -0.487739 0.313408
totalener: -1071.51284735 hartree
nucrepener: 2041.45311016 hartree
electener: -3112.96595751 hartree
oneelecener: -5514.42691264 hartree
twoeener: 2401.46095513 hartree
kineticenergy: 1066.93392562 hartree
xcener: -102.627558128331 hartree
chargesum: -0.0000000
charge: -0.257233 -0.358363 -0.336809 -0.381508 -0.128487 -0.140014 0.047209 -0.015384 -0.068369 -0.245946 -0.253014 -0.191069 0.312707 -0.019542 -0.239692 -0.249360 0.069313 0.225711 0.301901 -0.027961 -0.117760 -0.421543 0.148672 0.100155 0.087715 0.097325 0.080150 0.074461 0.094145 0.079370 0.109062 0.106487 0.087451 0.099498 0.072141 0.097097 0.084725 0.091307 0.128162 0.131531 0.104464 0.113347 0.124568 0.133398 0.249978
qa: -0.2572 -0.3584 -0.3368 -0.3815 -0.1285 -0.1400 0.0472 -0.0154 -0.0684 -0.2459 -0.2530 -0.1911 0.3127 -0.0195 -0.2397 -0.2494 0.0693 0.2257 0.3019 -0.0280 -0.1178 -0.4215 0.1487 0.1002 0.0877 0.0973 0.0802 0.0745 0.0941 0.0794 0.1091 0.1065 0.0875 0.0995 0.0721 0.0971 0.0847 0.0913 0.1282 0.1315 0.1045 0.1133 0.1246 0.1334 0.2500
va: 2.0833 2.1495 2.1768 2.1307 3.1346 3.1147 3.7250 3.8087 3.8382 3.9195 3.8908 3.8727 4.2383 3.6827 3.9430 3.9442 3.9210 4.2457 4.3422 3.8902 3.9388 3.9054 3.5651 1.0059 1.0266 1.0027 1.0065 1.0091 1.0101 1.0005 1.0068 1.0285 1.0114 1.0019 0.9958 1.0045 1.0084 0.9966 1.0024 1.0051 1.0094 1.0097 0.9803 1.0093 0.9697
dispcorr: -0.025949680 hartree
energy: -1071.538797029323
dipole: 17.14253 -17.87429 -0.73176 -17.21938 15.77749 -1.44189 9.61510 -8.53086 1.08423
magnitude: 1.94681 au
magnitude: 4.94840 debye
