program: Orca
programVersion: 5.0.2
elementType: O O O O N N C C C C C C C C C C C C C C C C C H H H H H H H H H H H H H H H H H H H H H H
charge: 0
multiplicity: 1
keywords: wb97x-d3
keywords: def2-TZVPP
keywords: def2/J RIJCOSX
keywords: DEFGRID2
keywords: scfconv7
keywords: smallprint printgap noloewdin
keywords: NOSOSCF
formula: C17H22N2O4
InChI: InChI=1/C17H22N2O4/c1-6-7-18-9-13(20)19(16(18)22)10-23-15(21)14-12(8-11(2)3)17(14,4)5/h1,8,12,14H,7,9-10H2,2-5H3
45 atoms
O  0.909715 1.269306 -0.497828
O  2.26149 2.604577 -1.662846
O  -0.955424 1.750759 2.224894
O  -2.128103 0.97667 -2.111778
N  -1.295725 1.619243 -0.047744
N  -3.12838 0.384936 -0.122259
C  3.491202 -0.173629 0.284926
C  2.760844 -0.987153 -0.738129
C  3.065115 0.471212 -1.024382
C  4.977314 -0.410326 0.423365
C  2.839557 0.221691 1.588697
C  1.379231 -1.511955 -0.580504
C  2.065416 1.55804 -1.105756
C  0.99319 -2.410502 0.325186
C  -0.425013 -2.893246 0.370827
C  1.903079 -3.010642 1.352773
C  -0.106298 2.254716 -0.508597
C  -1.581317 1.373375 1.275375
C  -2.191603 0.974176 -0.912083
C  -2.84596 0.536398 1.277346
C  -4.215646 -0.400851 -0.639333
C  -4.14589 -1.798311 -0.220814
C  -4.091181 -2.938914 0.145667
H  3.401382 -1.647475 -1.320355
H  3.872284 0.656885 -1.723286
H  5.172435 -1.224244 1.125243
H  5.441016 -0.676435 -0.527271
H  5.48236 0.480274 0.800977
H  1.754678 0.231003 1.553114
H  3.134782 -0.478957 2.3714
H  3.177298 1.211845 1.900385
H  0.645647 -1.173279 -1.304113
H  -0.481093 -3.976359 0.233916
H  -0.879602 -2.680737 1.342878
H  -1.045193 -2.428856 -0.394623
H  1.581289 -2.746907 2.363541
H  1.876632 -4.10173 1.293921
H  2.938866 -2.698741 1.237655
H  0.147119 3.076199 0.161914
H  -0.274328 2.642866 -1.512351
H  -2.663139 -0.421743 1.773265
H  -3.64516 1.051339 1.818808
H  -4.187699 -0.333353 -1.727917
H  -5.172467 0.023504 -0.318679
H  -4.037235 -3.95504 0.4559
totalener: -1071.51234908 hartree
nucrepener: 2046.80745965 hartree
electener: -3118.31980873 hartree
oneelecener: -5525.31730737 hartree
twoeener: 2406.99749864 hartree
kineticenergy: 1066.94550032 hartree
xcener: -102.629683896274 hartree
chargesum: -0.0000000
charge: -0.254520 -0.358665 -0.338634 -0.379683 -0.134175 -0.153619 0.044961 -0.008362 -0.066869 -0.246643 -0.259101 -0.192909 0.316083 -0.008233 -0.240534 -0.255344 0.064355 0.226438 0.320447 -0.036070 -0.084928 -0.410152 0.110894 0.100108 0.086825 0.080322 0.074047 0.096797 0.106025 0.076862 0.104735 0.095584 0.093625 0.077468 0.087307 0.094090 0.096062 0.083928 0.128970 0.131624 0.114220 0.110473 0.131788 0.125061 0.249341
qa: -0.2545 -0.3587 -0.3386 -0.3797 -0.1342 -0.1536 0.0450 -0.0084 -0.0669 -0.2466 -0.2591 -0.1929 0.3161 -0.0082 -0.2405 -0.2553 0.0644 0.2264 0.3204 -0.0361 -0.0849 -0.4102 0.1109 0.1001 0.0868 0.0803 0.0740 0.0968 0.1060 0.0769 0.1047 0.0956 0.0936 0.0775 0.0873 0.0941 0.0961 0.0839 0.1290 0.1316 0.1142 0.1105 0.1318 0.1251 0.2493
va: 2.0852 2.1472 2.1738 2.1402 3.1277 3.1201 3.7364 3.7872 3.8386 3.9193 3.8997 3.8868 4.2382 3.7196 3.9444 3.9450 3.9223 4.2419 4.3440 3.8926 3.8952 3.7777 3.6205 1.0061 1.0274 1.0064 1.0091 1.0030 1.0081 1.0021 1.0058 1.0266 1.0013 0.9953 1.0050 0.9965 1.0039 1.0088 0.9984 1.0094 1.0075 1.0104 1.0112 0.9828 0.9709
dispcorr: -0.026007448 hartree
energy: -1071.538356528056
dipole: 15.06246 -16.09418 -1.03173 -18.16962 16.85528 -1.31435 9.60834 -8.68660 0.92174
magnitude: 1.90829 au
magnitude: 4.85048 debye
