program: Orca
programVersion: 5.0.2
elementType: O O O O N N C C C C C C C C C C C C C C C C C H H H H H H H H H H H H H H H H H H H H H H
charge: 0
multiplicity: 1
keywords: wb97x-d3
keywords: def2-TZVPP
keywords: def2/J RIJCOSX
keywords: DEFGRID2
keywords: scfconv7
keywords: smallprint printgap noloewdin
keywords: NOSOSCF
formula: C17H22N2O4
InChI: InChI=1/C17H22N2O4/c1-6-7-18-9-13(20)19(16(18)22)10-23-15(21)14-12(8-11(2)3)17(14,4)5/h1,8,12,14H,7,9-10H2,2-5H3
45 atoms
O  0.26909 1.09215 -0.598777
O  1.816454 1.240784 1.017273
O  -1.614608 -0.095893 1.75817
O  -2.810681 2.655665 -1.673745
N  -1.901394 1.460724 0.090868
N  -3.98792 1.051639 -0.511475
C  3.555542 -0.587207 -0.772431
C  2.689518 -1.540918 -0.013308
C  2.055268 -0.368267 -0.746896
C  4.104476 -1.060424 -2.098482
C  4.495473 0.337511 -0.040133
C  2.672196 -1.639005 1.46975
C  1.417447 0.726954 0.009308
C  3.629674 -2.218165 2.194129
C  3.516345 -2.326419 3.684698
C  4.875473 -2.806161 1.604784
C  -0.580157 2.004532 0.066398
C  -2.283891 0.427767 0.913153
C  -2.905335 1.817029 -0.818674
C  -3.711551 0.09674 0.525672
C  -5.193037 1.04633 -1.295921
C  -5.376204 -0.202204 -2.032371
C  -5.528261 -1.238086 -2.617207
H  2.500646 -2.485795 -0.51873
H  1.530042 -0.622455 -1.659997
H  3.4121 -1.724994 -2.617222
H  4.313794 -0.21744 -2.759242
H  5.039079 -1.606323 -1.952476
H  4.634544 1.264933 -0.598346
H  4.157361 0.590862 0.9592
H  5.472932 -0.140936 0.047785
H  1.798911 -1.252955 1.984074
H  4.356849 -1.832046 4.178244
H  2.59739 -1.876297 4.057222
H  3.536009 -3.370814 4.006848
H  4.958841 -3.866576 1.857446
H  4.915923 -2.718284 0.520643
H  5.765059 -2.320374 2.013832
H  -0.238266 2.187181 1.083839
H  -0.609161 2.941244 -0.487994
H  -3.777222 -0.937039 0.172035
H  -4.376522 0.202899 1.387453
H  -5.144387 1.886703 -1.989676
H  -6.05919 1.216963 -0.64943
H  -5.666689 -2.149112 -3.148374
totalener: -1071.51541033 hartree
nucrepener: 1926.98833458 hartree
electener: -2998.50374491 hartree
oneelecener: -5286.26669356 hartree
twoeener: 2287.76294865 hartree
kineticenergy: 1066.93684049 hartree
xcener: -102.627139970158 hartree
chargesum: 0.0000000
charge: -0.275458 -0.372575 -0.341792 -0.383901 -0.136568 -0.169950 0.065832 -0.040874 -0.062650 -0.239772 -0.260459 -0.169634 0.337642 -0.027216 -0.209178 -0.253904 0.056583 0.231401 0.343721 -0.017050 -0.089526 -0.400883 0.107177 0.098973 0.084067 0.072819 0.093451 0.082429 0.094164 0.116965 0.077603 0.097289 0.082382 0.084693 0.082240 0.095958 0.078063 0.091569 0.141741 0.118717 0.109943 0.103297 0.130446 0.124176 0.248051
qa: -0.2755 -0.3726 -0.3418 -0.3839 -0.1366 -0.1699 0.0658 -0.0409 -0.0626 -0.2398 -0.2605 -0.1696 0.3376 -0.0272 -0.2092 -0.2539 0.0566 0.2314 0.3437 -0.0170 -0.0895 -0.4009 0.1072 0.0990 0.0841 0.0728 0.0935 0.0824 0.0942 0.1170 0.0776 0.0973 0.0824 0.0847 0.0822 0.0960 0.0781 0.0916 0.1417 0.1187 0.1099 0.1033 0.1304 0.1242 0.2481
va: 2.1061 2.1183 2.1716 2.1426 3.1032 3.1403 3.7298 3.8814 3.8387 3.9040 3.9028 3.8904 4.1579 3.7438 3.9387 3.9384 3.9026 4.2492 4.3406 3.8887 3.9101 3.7798 3.6313 1.0045 1.0303 1.0078 1.0048 1.0066 1.0055 1.0161 0.9997 1.0273 0.9991 1.0117 0.9977 1.0037 1.0088 0.9980 1.0131 1.0114 1.0111 1.0082 1.0112 0.9831 0.9709
dispcorr: -0.021422134 hartree
energy: -1071.536832467692
dipole: 30.82560 -31.72710 -0.90150 -16.09820 15.27180 -0.82640 4.97674 -5.32183 -0.34509
magnitude: 1.27071 au
magnitude: 3.22990 debye
