program: Orca
programVersion: 5.0.2
elementType: O O O O N N C C C C C C C C C C C C C C C C C H H H H H H H H H H H H H H H H H H H H H H
charge: 0
multiplicity: 1
keywords: wb97x-d3
keywords: def2-TZVPP
keywords: def2/J RIJCOSX
keywords: DEFGRID2
keywords: scfconv7
keywords: smallprint printgap noloewdin
keywords: NOSOSCF
formula: C17H22N2O4
InChI: InChI=1/C17H22N2O4/c1-6-7-18-9-13(20)19(16(18)22)10-23-15(21)14-12(8-11(2)3)17(14,4)5/h1,8,12,14H,7,9-10H2,2-5H3
45 atoms
O  0.066466 0.56398 -0.011347
O  1.843769 1.303024 1.110316
O  -2.541659 -0.374153 2.044958
O  -2.315576 2.502833 -1.486832
N  -2.101694 1.174578 0.398745
N  -4.013438 1.150504 -0.712644
C  3.537931 -0.392512 -0.879659
C  3.099701 -1.413827 0.123815
C  2.073189 -0.468521 -0.507543
C  3.866058 -0.904468 -2.263653
C  4.407553 0.770756 -0.46798
C  3.45598 -1.352216 1.551997
C  1.373016 0.558059 0.290567
C  3.84077 -2.382599 2.310554
C  4.165006 -2.178535 3.761267
C  3.99125 -3.799192 1.842734
C  -0.745336 1.47692 0.709544
C  -2.861538 0.243268 1.069842
C  -2.76906 1.702476 -0.715113
C  -4.180604 0.173876 0.326884
C  -4.954286 1.334694 -1.78452
C  -5.145164 0.11976 -2.573173
C  -5.308198 -0.889364 -3.200327
H  3.010371 -2.41817 -0.27475
H  1.431614 -0.935984 -1.245286
H  3.729211 -0.12245 -3.012601
H  4.904993 -1.235673 -2.312234
H  3.237436 -1.749081 -2.54954
H  4.288642 1.599897 -1.167289
H  4.196621 1.148893 0.52639
H  5.454247 0.463162 -0.495091
H  3.396296 -0.381423 2.028197
H  4.038465 -1.141285 4.068063
H  3.523019 -2.795172 4.395817
H  5.194458 -2.472357 3.981739
H  5.014703 -4.147108 2.003167
H  3.344282 -4.465388 2.418846
H  3.760834 -3.946117 0.79017
H  -0.595556 1.370344 1.783618
H  -0.52909 2.503023 0.41277
H  -4.338006 -0.835225 -0.066995
H  -5.010687 0.408155 0.999196
H  -4.58568 2.141195 -2.419829
H  -5.917745 1.661708 -1.382444
H  -5.447916 -1.77835 -3.767146
totalener: -1071.51810159 hartree
nucrepener: 1897.47013008 hartree
electener: -2968.98823168 hartree
oneelecener: -5226.99248980 hartree
twoeener: 2258.00425812 hartree
kineticenergy: 1066.92914710 hartree
xcener: -102.626205434841 hartree
chargesum: -0.0000000
charge: -0.263969 -0.395989 -0.337036 -0.379439 -0.152919 -0.170782 0.094598 0.031181 -0.085205 -0.238946 -0.253090 -0.214238 0.349919 -0.054617 -0.204016 -0.242246 0.088946 0.233405 0.343045 -0.026334 -0.086358 -0.401304 0.106004 0.084975 0.080955 0.090032 0.088731 0.069492 0.087204 0.103790 0.084921 0.106439 0.081686 0.082660 0.081016 0.086366 0.087903 0.075942 0.124122 0.126888 0.110242 0.103614 0.130786 0.123531 0.248094
qa: -0.2640 -0.3960 -0.3370 -0.3794 -0.1529 -0.1708 0.0946 0.0312 -0.0852 -0.2389 -0.2531 -0.2142 0.3499 -0.0546 -0.2040 -0.2422 0.0889 0.2334 0.3430 -0.0263 -0.0864 -0.4013 0.1060 0.0850 0.0810 0.0900 0.0887 0.0695 0.0872 0.1038 0.0849 0.1064 0.0817 0.0827 0.0810 0.0864 0.0879 0.0759 0.1241 0.1269 0.1102 0.1036 0.1308 0.1235 0.2481
va: 2.1199 2.0927 2.1808 2.1469 3.1337 3.1344 3.7301 3.7979 3.8964 3.9122 3.9174 3.9049 4.1484 3.8237 3.9385 3.9457 3.9080 4.2556 4.3395 3.8876 3.9091 3.7806 3.6331 1.0110 1.0295 1.0050 1.0040 1.0082 1.0026 1.0194 1.0019 1.0257 1.0128 0.9984 0.9980 0.9992 0.9990 1.0169 1.0048 1.0024 1.0109 1.0083 1.0112 0.9832 0.9709
dispcorr: -0.019597059 hartree
energy: -1071.537698652448
dipole: 30.44231 -31.41923 -0.97692 -15.36770 14.59230 -0.77539 3.01459 -3.65313 -0.63855
magnitude: 1.40120 au
magnitude: 3.56156 debye
