program: Orca
programVersion: 5.0.2
elementType: O O O O N N C C C C C C C C C C C C C C C C C H H H H H H H H H H H H H H H H H H H H H H
charge: 0
multiplicity: 1
keywords: wb97x-d3
keywords: def2-TZVPP
keywords: def2/J RIJCOSX
keywords: DEFGRID2
keywords: scfconv7
keywords: smallprint printgap noloewdin
keywords: NOSOSCF
formula: C17H22N2O4
InChI: InChI=1/C17H22N2O4/c1-6-7-18-9-13(20)19(16(18)22)10-23-15(21)14-12(8-11(2)3)17(14,4)5/h1,8,12,14H,7,9-10H2,2-5H3
45 atoms
O  0.822216 1.870478 -1.04714
O  1.1504 1.210992 1.064019
O  -1.658616 2.378154 1.938727
O  -1.57901 0.162382 -2.046132
N  -1.355241 1.505125 -0.174761
N  -2.466876 -0.398315 0.006291
C  3.927322 0.206111 0.180657
C  3.001959 -0.840125 -0.343244
C  2.737914 0.642577 -0.64369
C  5.259049 0.3356 -0.524584
C  4.027603 0.496492 1.658561
C  2.0853 -1.623327 0.514478
C  1.524224 1.258278 -0.075959
C  1.144323 -2.453828 0.060258
C  0.276034 -3.227066 1.005917
C  0.85108 -2.67526 -1.392314
C  -0.420812 2.4492 -0.708533
C  -1.813706 1.513493 1.126995
C  -1.78626 0.380043 -0.881837
C  -2.595771 0.2271 1.293591
C  -3.241184 -1.541392 -0.393534
C  -4.680255 -1.288625 -0.350144
C  -5.857549 -1.068641 -0.28421
H  3.365921 -1.374991 -1.214989
H  2.948548 0.950109 -1.661343
H  5.182591 0.115127 -1.590242
H  5.659067 1.345717 -0.422509
H  5.986692 -0.35635 -0.096913
H  4.395784 1.510889 1.81905
H  3.086806 0.40881 2.191107
H  4.745012 -0.189244 2.113552
H  2.19677 -1.516799 1.587343
H  0.507866 -3.010788 2.04789
H  -0.779825 -2.993839 0.841414
H  0.382887 -4.303835 0.852582
H  -0.151764 -2.319602 -1.641394
H  1.538794 -2.157582 -2.056791
H  0.879674 -3.739373 -1.638972
H  -0.309257 3.244981 0.02918
H  -0.794931 2.862187 -1.642302
H  -2.161782 -0.372566 2.098522
H  -3.636735 0.445997 1.550018
H  -3.004672 -2.393144 0.251284
H  -2.939203 -1.816842 -1.405012
H  -6.902251 -0.873652 -0.24166
totalener: -1071.51318994 hartree
nucrepener: 2056.66035324 hartree
electener: -3128.17354318 hartree
oneelecener: -5545.46030482 hartree
twoeener: 2417.28676163 hartree
kineticenergy: 1066.94102825 hartree
xcener: -102.629696317329 hartree
chargesum: 0.0000000
charge: -0.262669 -0.385936 -0.329573 -0.377910 -0.145592 -0.149148 0.137951 -0.063745 -0.084140 -0.241224 -0.272919 -0.152157 0.349556 -0.047834 -0.214129 -0.236152 0.086889 0.253743 0.301944 -0.035017 -0.126860 -0.432911 0.161745 0.085866 0.080385 0.071602 0.091254 0.089575 0.087540 0.101661 0.089139 0.091906 0.086446 0.054976 0.095483 0.086447 0.084028 0.091146 0.128230 0.124410 0.106003 0.113931 0.125587 0.130422 0.250050
qa: -0.2627 -0.3859 -0.3296 -0.3779 -0.1456 -0.1491 0.1380 -0.0637 -0.0841 -0.2412 -0.2729 -0.1522 0.3496 -0.0478 -0.2141 -0.2362 0.0869 0.2537 0.3019 -0.0350 -0.1269 -0.4329 0.1617 0.0859 0.0804 0.0716 0.0913 0.0896 0.0875 0.1017 0.0891 0.0919 0.0864 0.0550 0.0955 0.0864 0.0840 0.0911 0.1282 0.1244 0.1060 0.1139 0.1256 0.1304 0.2501
va: 2.1267 2.0961 2.1934 2.1423 3.0965 3.1023 3.7639 3.8598 3.8557 3.8978 3.9048 3.8821 4.1573 3.7677 3.9396 3.9479 3.9218 4.2359 4.3574 3.8800 3.9725 3.9540 3.5439 1.0076 1.0318 1.0068 1.0052 1.0045 1.0039 1.0240 0.9986 1.0158 1.0115 0.9995 1.0020 1.0081 1.0134 0.9995 1.0148 0.9939 1.0085 1.0125 0.9753 1.0079 0.9697
dispcorr: -0.025098725 hartree
energy: -1071.538288667827
dipole: 18.91400 -19.04460 -0.13060 -15.56582 14.71646 -0.84936 1.60040 -1.77989 -0.17949
magnitude: 0.87789 au
magnitude: 2.23141 debye
