program: Orca
programVersion: 5.0.2
elementType: O O O O N N C C C C C C C C C C C C C C C C C H H H H H H H H H H H H H H H H H H H H H H
charge: 0
multiplicity: 1
keywords: wb97x-d3
keywords: def2-TZVPP
keywords: def2/J RIJCOSX
keywords: DEFGRID2
keywords: scfconv7
keywords: smallprint printgap noloewdin
keywords: NOSOSCF
formula: C17H22N2O4
InChI: InChI=1/C17H22N2O4/c1-6-7-18-9-13(20)19(16(18)22)10-23-15(21)14-12(8-11(2)3)17(14,4)5/h1,8,12,14H,7,9-10H2,2-5H3
45 atoms
O  0.398235 1.521237 1.615123
O  0.054508 -0.666212 1.293916
O  2.110819 2.668141 -0.615601
O  3.080063 -1.266745 1.472443
N  2.483259 0.853628 0.740867
N  3.607705 -0.475719 -0.622254
C  -2.077807 0.866114 -0.602778
C  -2.716873 -0.087784 0.369674
C  -1.705783 0.905294 0.871304
C  -2.881376 2.032541 -1.119325
C  -1.093653 0.323205 -1.609934
C  -4.131924 0.059419 0.78467
C  -0.361112 0.466883 1.281944
C  -5.130501 -0.766901 0.460548
C  -6.525856 -0.520494 0.949283
C  -4.969928 -1.983397 -0.398151
C  1.768509 1.301432 1.901324
C  2.544271 1.55527 -0.434462
C  3.058035 -0.416375 0.610987
C  3.230011 0.659593 -1.428015
C  4.021867 -1.726971 -1.212628
C  2.908732 -2.460411 -1.812142
C  1.98576 -3.048423 -2.308034
H  -2.353829 -1.107746 0.290696
H  -2.082349 1.768433 1.411216
H  -3.508354 1.721079 -1.9571
H  -3.533345 2.462333 -0.360288
H  -2.222009 2.824748 -1.477429
H  -1.61754 0.053124 -2.528531
H  -0.345961 1.076095 -1.869611
H  -0.57069 -0.567393 -1.264075
H  -4.365636 0.923832 1.40001
H  -7.22002 -0.407164 0.112559
H  -6.889826 -1.366754 1.537842
H  -6.594003 0.374079 1.568065
H  -3.951824 -2.137587 -0.750701
H  -5.279343 -2.882704 0.140515
H  -5.616189 -1.915617 -1.277114
H  2.148543 2.265913 2.22691
H  1.909408 0.578457 2.703347
H  2.529476 0.390046 -2.224591
H  4.09146 1.154625 -1.878478
H  4.50935 -2.337357 -0.452309
H  4.778329 -1.518234 -1.970067
H  1.171374 -3.580164 -2.74712
elementType: O N C H
totalener: -1071.53952858 hartree
nucrepener: 1993.43826113 hartree
electener: -3064.97778971 hartree
oneelecener: -5419.88694716 hartree
twoeener: 2354.90915744 hartree
cpcmener: -0.05557900 hartree
kineticenergy: 1066.86639412 hartree
xcener: -102.624728354538 hartree
chargesum: 0.0000000
charge: -0.275936 -0.470006 -0.474050 -0.506239 -0.112459 -0.159561 0.155213 0.005361 -0.139919 -0.265456 -0.285053 -0.286004 0.412005 -0.032944 -0.227477 -0.252517 0.068596 0.293704 0.397317 0.002928 -0.035623 -0.416787 0.035716 0.096030 0.102097 0.096920 0.091360 0.098428 0.104757 0.095314 0.085503 0.123773 0.094222 0.094625 0.089610 0.089176 0.097435 0.096343 0.152248 0.138848 0.129375 0.129469 0.136188 0.141734 0.285732
qa: -0.2759 -0.4700 -0.4741 -0.5062 -0.1125 -0.1596 0.1552 0.0054 -0.1399 -0.2655 -0.2851 -0.2860 0.4120 -0.0329 -0.2275 -0.2525 0.0686 0.2937 0.3973 0.0029 -0.0356 -0.4168 0.0357 0.0960 0.1021 0.0969 0.0914 0.0984 0.1048 0.0953 0.0855 0.1238 0.0942 0.0946 0.0896 0.0892 0.0974 0.0963 0.1522 0.1388 0.1294 0.1295 0.1362 0.1417 0.2857
va: 2.1122 2.0366 2.0273 2.0084 3.0992 3.1839 3.6823 3.7919 3.8671 3.8977 3.9066 3.8691 4.1917 3.7131 3.9241 3.9433 3.8885 4.1662 4.3065 3.9192 3.9004 3.7248 3.6122 1.0258 1.0337 1.0028 1.0027 1.0034 1.0025 1.0072 1.0102 1.0067 0.9962 0.9956 1.0079 1.0085 0.9975 0.9972 0.9923 1.0153 0.9990 1.0099 1.0011 0.9872 0.9471
dispcorr: -0.023301622 hartree
energy: -1071.562830206266
dipole: -32.42243 32.57744 0.15502 -2.38162 2.82144 0.43981 -9.25652 7.54532 -1.71120
magnitude: 1.77360 au
magnitude: 4.50814 debye
