program: Orca
programVersion: 5.0.2
elementType: O O O O N N C C C C C C C C C C C C C C C C C H H H H H H H H H H H H H H H H H H H H H H
charge: 0
multiplicity: 1
keywords: wb97x-d3
keywords: def2-TZVPP
keywords: def2/J RIJCOSX
keywords: DEFGRID2
keywords: scfconv7
keywords: smallprint printgap noloewdin
keywords: NOSOSCF
formula: C17H22N2O4
InChI: InChI=1/C17H22N2O4/c1-6-7-18-9-13(20)19(16(18)22)10-23-15(21)14-12(8-11(2)3)17(14,4)5/h1,8,12,14H,7,9-10H2,2-5H3
45 atoms
O  0.214375 1.549082 1.326146
O  0.20489 1.899025 -0.882521
O  3.317332 1.804921 -1.008561
O  1.507727 -1.127016 1.975143
N  2.300441 0.620853 0.685855
N  2.985022 -1.434625 0.230517
C  -2.901871 1.993114 -0.662865
C  -2.563892 0.545113 -0.694737
C  -1.845578 1.467898 0.291574
C  -4.184033 2.431023 0.005618
C  -2.537927 2.85322 -1.85005
C  -3.464442 -0.511394 -0.170792
C  -0.402078 1.676215 0.138258
C  -3.055457 -1.703631 0.271009
C  -4.029901 -2.726944 0.767266
C  -1.61681 -2.115084 0.322738
C  1.622759 1.677347 1.379977
C  3.054304 0.767865 -0.450946
C  2.188222 -0.721258 1.057776
C  3.496784 -0.614319 -0.841062
C  2.861712 -2.866625 0.087333
C  1.848938 -3.241861 -0.896747
C  1.022973 -3.536959 -1.717478
H  -1.938252 0.250906 -1.533863
H  -2.169374 1.368472 1.320766
H  -4.41189 1.855022 0.90234
H  -4.119546 3.48064 0.297283
H  -5.02783 2.330994 -0.679696
H  -2.268051 3.864585 -1.541887
H  -1.72081 2.447398 -2.440659
H  -3.405015 2.933081 -2.508229
H  -4.527961 -0.291514 -0.159778
H  -3.989808 -3.63344 0.157913
H  -3.790223 -3.032419 1.788804
H  -5.055286 -2.358328 0.756457
H  -1.304944 -2.2886 1.35621
H  -1.471049 -3.062017 -0.20268
H  -0.938069 -1.382628 -0.112203
H  1.959558 2.629542 0.97239
H  1.86842 1.643664 2.438051
H  3.065988 -0.879849 -1.811255
H  4.583741 -0.667476 -0.921012
H  2.627179 -3.303879 1.057498
H  3.830099 -3.272072 -0.207998
H  0.279181 -3.789775 -2.439744
elementType: O N C H
totalener: -1071.53876645 hartree
nucrepener: 2029.12856318 hartree
electener: -3100.66732963 hartree
oneelecener: -5491.44541229 hartree
twoeener: 2390.77808267 hartree
cpcmener: -0.05216367 hartree
kineticenergy: 1066.87675341 hartree
xcener: -102.627832504583 hartree
chargesum: 0.0000000
charge: -0.284128 -0.490979 -0.472058 -0.509908 -0.109657 -0.156999 0.181513 -0.025059 -0.125283 -0.293570 -0.283174 -0.298677 0.422073 0.006115 -0.232470 -0.250012 0.070505 0.316987 0.380438 0.000590 -0.021331 -0.425831 0.023857 0.110561 0.092445 0.092706 0.098813 0.100581 0.101975 0.091260 0.094321 0.125741 0.097703 0.095322 0.090290 0.100809 0.100903 0.069952 0.136014 0.154002 0.127258 0.125883 0.135569 0.142581 0.292367
qa: -0.2841 -0.4910 -0.4721 -0.5099 -0.1097 -0.1570 0.1815 -0.0251 -0.1253 -0.2936 -0.2832 -0.2987 0.4221 0.0061 -0.2325 -0.2500 0.0705 0.3170 0.3804 0.0006 -0.0213 -0.4258 0.0239 0.1106 0.0924 0.0927 0.0988 0.1006 0.1020 0.0913 0.0943 0.1257 0.0977 0.0953 0.0903 0.1008 0.1009 0.0700 0.1360 0.1540 0.1273 0.1259 0.1356 0.1426 0.2924
va: 2.1059 2.0163 2.0382 1.9970 3.1049 3.2028 3.6889 3.8303 3.8235 3.9176 3.8754 3.8960 4.1150 3.7186 3.9303 3.9470 3.8887 4.1767 4.3115 3.9016 3.8973 3.7366 3.6188 1.0182 1.0343 1.0008 1.0025 0.9988 0.9994 1.0196 1.0008 1.0023 0.9955 0.9960 1.0062 1.0026 0.9983 1.0019 1.0165 0.9926 1.0047 1.0087 1.0022 0.9873 0.9434
dispcorr: -0.024176977 hartree
energy: -1071.562943426603
dipole: -26.32503 26.45274 0.12771 -4.38212 2.87535 -1.50677 -3.02555 3.11148 0.08593
magnitude: 1.51462 au
magnitude: 3.84985 debye
