program: Orca
programVersion: 5.0.2
elementType: O O O O N N C C C C C C C C C C C C C C C C C H H H H H H H H H H H H H H H H H H H H H H
charge: 0
multiplicity: 1
keywords: wb97x-d3
keywords: def2-TZVPP
keywords: def2/J RIJCOSX
keywords: DEFGRID2
keywords: scfconv7
keywords: smallprint printgap noloewdin
keywords: NOSOSCF
formula: C17H22N2O4
InChI: InChI=1/C17H22N2O4/c1-6-7-18-9-13(20)19(16(18)22)10-23-15(21)14-12(8-11(2)3)17(14,4)5/h1,8,12,14H,7,9-10H2,2-5H3
45 atoms
O  0.401471 1.527507 1.368518
O  -0.121675 -0.64707 1.306993
O  1.89834 2.238267 -1.177783
O  2.895207 -1.45594 1.296098
N  2.306087 0.57741 0.353108
N  2.862466 -1.098962 -0.979139
C  -2.373485 0.886151 -0.460616
C  -2.941289 0.060194 0.659825
C  -1.816509 1.011271 0.949773
C  -3.164066 2.064331 -0.968692
C  -1.562883 0.199153 -1.531602
C  -4.284971 0.334903 1.228331
C  -0.461169 0.509444 1.233984
C  -5.401416 -0.325399 0.909078
C  -6.714262 0.014354 1.545749
C  -5.450424 -1.43429 -0.09576
C  1.778929 1.225291 1.518953
C  2.255993 1.117548 -0.904425
C  2.712688 -0.762653 0.320462
C  2.724611 0.045554 -1.846688
C  3.555591 -2.294163 -1.397016
C  4.982414 -2.072689 -1.621309
C  6.149958 -1.87054 -1.819733
H  -2.654907 -0.987095 0.624088
H  -2.066178 1.939767 1.4540
H  -3.698007 2.583675 -0.173791
H  -2.508113 2.787335 -1.456715
H  -3.901407 1.737299 -1.7049
H  -2.215959 -0.105167 -2.351591
H  -0.810595 0.873846 -1.946771
H  -1.053742 -0.695825 -1.176744
H  -4.352476 1.139342 1.955233
H  -7.131757 -0.849915 2.068718
H  -6.625512 0.830819 2.262059
H  -7.451117 0.303706 0.792175
H  -5.814336 -2.357844 0.361744
H  -6.153488 -1.191495 -0.896541
H  -4.485998 -1.644001 -0.555687
H  2.265527 2.184901 1.670124
H  1.965997 0.594773 2.386871
H  1.995545 -0.120381 -2.641413
H  3.674721 0.338373 -2.303815
H  3.09589 -2.664598 -2.314372
H  3.409184 -3.068899 -0.644977
H  7.187141 -1.703963 -2.008144
elementType: O N C H
totalener: -1071.53914763 hartree
nucrepener: 1970.72549468 hartree
electener: -3042.26464232 hartree
oneelecener: -5374.13549963 hartree
twoeener: 2331.87085731 hartree
cpcmener: -0.05243829 hartree
kineticenergy: 1066.87123823 hartree
xcener: -102.625740169534 hartree
chargesum: -0.0000000
charge: -0.276444 -0.470010 -0.473764 -0.506470 -0.118797 -0.152393 0.157830 -0.021359 -0.132758 -0.271782 -0.294847 -0.267480 0.414707 -0.037335 -0.230075 -0.249147 0.071363 0.297650 0.389536 0.005414 -0.035517 -0.437214 0.056754 0.098259 0.103354 0.092802 0.100246 0.097024 0.104604 0.095238 0.092303 0.123761 0.095368 0.089972 0.094269 0.100213 0.096479 0.087780 0.152073 0.139471 0.125169 0.132969 0.141823 0.131379 0.287583
qa: -0.2764 -0.4700 -0.4738 -0.5065 -0.1188 -0.1524 0.1578 -0.0214 -0.1328 -0.2718 -0.2948 -0.2675 0.4147 -0.0373 -0.2301 -0.2491 0.0714 0.2976 0.3895 0.0054 -0.0355 -0.4372 0.0568 0.0983 0.1034 0.0928 0.1002 0.0970 0.1046 0.0952 0.0923 0.1238 0.0954 0.0900 0.0943 0.1002 0.0965 0.0878 0.1521 0.1395 0.1252 0.1330 0.1418 0.1314 0.2876
va: 2.1128 2.0381 2.0281 2.0095 3.1080 3.1830 3.6779 3.8169 3.8531 3.8973 3.8978 3.8597 4.2010 3.7032 3.9269 3.9389 3.8891 4.1721 4.3058 3.9085 3.9031 3.7498 3.5761 1.0229 1.0325 1.0018 1.0032 1.0015 1.0024 1.0089 1.0135 1.0064 0.9952 1.0075 0.9962 0.9981 0.9976 1.0083 0.9921 1.0157 1.0069 1.0055 0.9866 1.0053 0.9455
dispcorr: -0.023028009 hartree
energy: -1071.562175642848
dipole: -34.63870 34.33781 -0.30088 -0.29021 0.43642 0.14621 -6.27779 4.48515 -1.79264
magnitude: 1.82358 au
magnitude: 4.63518 debye
