program: Orca
programVersion: 5.0.2
elementType: O O O O N N C C C C C C C C C C C C C C C C C H H H H H H H H H H H H H H H H H H H H H H
charge: 0
multiplicity: 1
keywords: wb97x-d3
keywords: def2-TZVPP
keywords: def2/J RIJCOSX
keywords: DEFGRID2
keywords: scfconv7
keywords: smallprint printgap noloewdin
keywords: NOSOSCF
formula: C17H22N2O4
InChI: InChI=1/C17H22N2O4/c1-6-7-18-9-13(20)19(16(18)22)10-23-15(21)14-12(8-11(2)3)17(14,4)5/h1,8,12,14H,7,9-10H2,2-5H3
45 atoms
O  0.200385 1.135167 0.813913
O  -0.441454 2.753723 2.202674
O  2.318131 1.753481 -1.70075
O  2.628795 -1.11411 1.822184
N  2.367437 0.596776 0.283343
N  3.609423 -1.147296 -0.263694
C  -2.591707 1.744532 -0.443383
C  -2.52435 0.384627 0.187333
C  -2.108843 1.593004 0.992238
C  -3.938862 2.401881 -0.615253
C  -1.625458 2.086111 -1.550356
C  -3.750182 -0.346573 0.593236
C  -0.725503 1.891703 1.399842
C  -4.262127 -1.410721 -0.031502
C  -5.508191 -2.075937 0.469427
C  -3.666968 -2.025524 -1.260201
C  1.562336 1.461981 1.076216
C  2.663513 0.804564 -1.039295
C  2.852531 -0.638941 0.730857
C  3.487786 -0.373806 -1.476746
C  4.058458 -2.519423 -0.269143
C  3.052339 -3.441848 -0.791969
C  2.226715 -4.191854 -1.237748
H  -1.710054 -0.233646 -0.176141
H  -2.821201 1.935964 1.735347
H  -4.422597 2.039689 -1.524743
H  -4.612339 2.206576 0.218217
H  -3.829732 3.483875 -0.707788
H  -2.089773 1.873056 -2.515092
H  -1.374316 3.148576 -1.537669
H  -0.697528 1.519821 -1.510045
H  -4.271044 0.032607 1.468023
H  -5.322481 -3.125195 0.712849
H  -5.904623 -1.588806 1.360137
H  -6.289409 -2.070771 -0.294993
H  -3.411245 -3.073601 -1.085329
H  -4.393259 -2.01932 -2.076995
H  -2.772005 -1.514918 -1.610665
H  1.770709 2.495949 0.803481
H  1.804398 1.313655 2.12727
H  2.970356 -0.920155 -2.270168
H  4.45721 -0.04752 -1.857734
H  4.338351 -2.80677 0.744196
H  4.966753 -2.583157 -0.869293
H  1.488622 -4.862644 -1.61777
elementType: O N C H
totalener: -1071.53972143 hartree
nucrepener: 1948.95960545 hartree
electener: -3020.49932688 hartree
oneelecener: -5329.97480798 hartree
twoeener: 2309.47548110 hartree
cpcmener: -0.05190775 hartree
kineticenergy: 1066.85630259 hartree
xcener: -102.622163716431 hartree
chargesum: -0.0000000
charge: -0.268032 -0.492925 -0.475510 -0.510141 -0.120434 -0.170856 0.146998 0.041371 -0.143859 -0.268140 -0.289226 -0.300866 0.432539 -0.028711 -0.228792 -0.253475 0.061012 0.317722 0.407659 0.010823 -0.046491 -0.432511 0.058154 0.104559 0.094075 0.096185 0.091366 0.099237 0.096709 0.105105 0.081069 0.123781 0.094896 0.089554 0.094391 0.098172 0.096610 0.088478 0.141865 0.136095 0.129829 0.124396 0.136662 0.142011 0.288645
qa: -0.2680 -0.4929 -0.4755 -0.5101 -0.1204 -0.1709 0.1470 0.0414 -0.1439 -0.2681 -0.2892 -0.3009 0.4325 -0.0287 -0.2288 -0.2535 0.0610 0.3177 0.4077 0.0108 -0.0465 -0.4325 0.0582 0.1046 0.0941 0.0962 0.0914 0.0992 0.0967 0.1051 0.0811 0.1238 0.0949 0.0896 0.0944 0.0982 0.0966 0.0885 0.1419 0.1361 0.1298 0.1244 0.1367 0.1420 0.2886
va: 2.1088 2.0041 2.0292 2.0066 3.1635 3.2016 3.6648 3.7417 3.9427 3.9081 3.9168 3.8667 4.1163 3.7093 3.9256 3.9448 3.8959 4.1543 4.2863 3.9134 3.9047 3.7483 3.5793 1.0156 1.0344 1.0025 1.0028 1.0022 1.0027 0.9988 1.0124 1.0072 0.9954 1.0077 0.9962 0.9975 0.9973 1.0083 1.0004 1.0054 1.0043 1.0076 0.9998 0.9867 0.9446
dispcorr: -0.021343401 hartree
energy: -1071.561064835626
dipole: -29.83649 30.56878 0.73229 -4.69485 2.92435 -1.77050 -9.83430 7.66845 -2.16585
magnitude: 2.89168 au
magnitude: 7.35007 debye
