program: Orca
programVersion: 5.0.2
elementType: O O O O N N C C C C C C C C C C C C C C C C C H H H H H H H H H H H H H H H H H H H H H H
charge: 0
multiplicity: 1
keywords: wb97x-d3
keywords: def2-TZVPP
keywords: def2/J RIJCOSX
keywords: DEFGRID2
keywords: scfconv7
keywords: smallprint printgap noloewdin
keywords: NOSOSCF
formula: C17H22N2O4
InChI: InChI=1/C17H22N2O4/c1-6-7-18-9-13(20)19(16(18)22)10-23-15(21)14-12(8-11(2)3)17(14,4)5/h1,8,12,14H,7,9-10H2,2-5H3
45 atoms
O  -0.004542 0.404405 1.299923
O  -0.028917 2.473005 0.449103
O  3.043915 2.405938 0.258052
O  1.945091 -1.993614 0.733531
N  2.288733 0.293362 0.788247
N  3.507489 -0.94159 -0.591638
C  -2.017944 0.094368 -1.139154
C  -2.578945 -0.264193 0.19693
C  -1.878178 1.066007 0.025763
C  -2.94537 0.540851 -2.242622
C  -0.806067 -0.652073 -1.644238
C  -4.041404 -0.305952 0.45832
C  -0.561944 1.397907 0.596549
C  -4.604599 -0.148753 1.658889
C  -6.087276 -0.249854 1.844822
C  -3.820675 0.133505 2.903386
C  1.311661 0.574165 1.798172
C  3.0264 1.212734 0.08284
C  2.524752 -1.007454 0.332954
C  3.807204 0.428432 -0.935667
C  3.736088 -2.026842 -1.51974
C  2.721194 -2.087587 -2.56937
C  1.881982 -2.12182 -3.428286
H  -2.000388 -1.00825 0.736853
H  -2.513012 1.942005 -0.051885
H  -3.356753 -0.321271 -2.771442
H  -3.779884 1.137266 -1.874409
H  -2.404546 1.146504 -2.971846
H  -0.138848 0.006524 -2.203744
H  -0.233017 -1.1229 -0.848244
H  -1.122825 -1.44817 -2.320804
H  -4.686405 -0.50912 -0.391793
H  -6.608197 -0.430319 0.904676
H  -6.341701 -1.06029 2.532737
H  -6.489944 0.665473 2.285885
H  -3.990163 -0.645003 3.650462
H  -2.748315 0.203242 2.730987
H  -4.148474 1.071024 3.357814
H  1.480473 1.574505 2.191236
H  1.410977 -0.141236 2.609472
H  3.460695 0.689004 -1.940602
H  4.873202 0.649597 -0.869986
H  3.76729 -2.968086 -0.971055
H  4.723924 -1.896081 -1.962083
H  1.134927 -2.165029 -4.189468
elementType: O N C H
totalener: -1071.53851676 hartree
nucrepener: 2009.02929320 hartree
electener: -3080.56780996 hartree
oneelecener: -5450.70759700 hartree
twoeener: 2370.13978705 hartree
cpcmener: -0.05552702 hartree
kineticenergy: 1066.86693357 hartree
xcener: -102.624902589400 hartree
chargesum: -0.0000000
charge: -0.269248 -0.481141 -0.468409 -0.504876 -0.091007 -0.153861 0.168060 0.002699 -0.134799 -0.302710 -0.292148 -0.306781 0.436551 -0.012380 -0.230674 -0.245257 0.041991 0.313484 0.365391 -0.000427 -0.027253 -0.414030 0.022896 0.105797 0.098365 0.100182 0.093863 0.099793 0.104573 0.083751 0.104051 0.125246 0.089487 0.096343 0.094866 0.100448 0.078751 0.098089 0.136880 0.147450 0.130705 0.126152 0.137680 0.141863 0.289591
qa: -0.2692 -0.4811 -0.4684 -0.5049 -0.0910 -0.1539 0.1681 0.0027 -0.1348 -0.3027 -0.2921 -0.3068 0.4366 -0.0124 -0.2307 -0.2453 0.0420 0.3135 0.3654 -0.0004 -0.0273 -0.4140 0.0229 0.1058 0.0984 0.1002 0.0939 0.0998 0.1046 0.0838 0.1041 0.1252 0.0895 0.0963 0.0949 0.1004 0.0788 0.0981 0.1369 0.1475 0.1307 0.1262 0.1377 0.1419 0.2896
va: 2.1007 2.0195 2.0393 2.0021 3.1053 3.1927 3.7482 3.7911 3.8549 3.9106 3.8817 3.8778 4.1092 3.7049 3.9295 3.9369 3.9220 4.1698 4.3153 3.9074 3.9056 3.7348 3.6249 1.0199 1.0274 0.9988 1.0014 1.0016 0.9955 1.0157 0.9986 1.0022 1.0065 0.9955 0.9964 0.9990 1.0191 0.9984 1.0147 1.0011 1.0021 1.0095 0.9981 0.9879 0.9453
dispcorr: -0.024383924 hartree
energy: -1071.562900683502
dipole: -28.18602 28.69618 0.51016 -4.15931 2.71380 -1.44551 -2.25798 1.33965 -0.91833
magnitude: 1.78693 au
magnitude: 4.54200 debye
