program: Orca
programVersion: 5.0.2
elementType: O O O O N N C C C C C C C C C C C C C C C C C H H H H H H H H H H H H H H H H H H H H H H
charge: 0
multiplicity: 1
keywords: wb97x-d3
keywords: def2-TZVPP
keywords: def2/J RIJCOSX
keywords: DEFGRID2
keywords: scfconv7
keywords: smallprint printgap noloewdin
keywords: NOSOSCF
formula: C17H22N2O4
InChI: InChI=1/C17H22N2O4/c1-6-7-18-9-13(20)19(16(18)22)10-23-15(21)14-12(8-11(2)3)17(14,4)5/h1,8,12,14H,7,9-10H2,2-5H3
45 atoms
O  0.160629 0.882935 -0.330418
O  -1.136007 2.044191 -1.725125
O  3.33241 1.972546 0.53046
O  1.799285 -1.787464 -1.537208
N  2.347648 0.300163 -0.700319
N  3.650545 -1.413017 -0.213971
C  -3.048717 2.219639 0.768595
C  -3.503867 1.131972 -0.136473
C  -2.050114 1.16366 0.308684
C  -3.410416 2.152428 2.232808
C  -2.972811 3.632127 0.244628
C  -4.384514 0.024693 0.316071
C  -1.005635 1.43157 -0.688282
C  -4.324688 -1.224926 -0.151116
C  -5.249579 -2.291977 0.346928
C  -3.326305 -1.667627 -1.177097
C  1.244801 1.016611 -1.244639
C  3.279562 0.82638 0.156288
C  2.529938 -1.078315 -0.879712
C  4.20179 -0.303052 0.521379
C  4.135483 -2.763555 -0.069805
C  3.963483 -3.274276 1.287717
C  3.841529 -3.670239 2.41505
H  -3.640922 1.43833 -1.171209
H  -1.770336 0.442848 1.067985
H  -4.405867 2.568607 2.399865
H  -3.405608 1.134023 2.620762
H  -2.705709 2.736426 2.827072
H  -3.905736 4.152124 0.470118
H  -2.165227 4.186852 0.725694
H  -2.826352 3.685386 -0.831503
H  -5.132403 0.265461 1.066332
H  -5.918961 -1.926658 1.125426
H  -5.860467 -2.692243 -0.465956
H  -4.686398 -3.136344 0.752772
H  -2.832993 -0.839573 -1.683326
H  -2.549786 -2.284799 -0.717098
H  -3.802687 -2.289668 -1.93761
H  0.988832 0.599691 -2.217645
H  1.525536 2.061789 -1.367536
H  5.228164 -0.077031 0.223496
H  4.184877 -0.468619 1.602046
H  5.193343 -2.799348 -0.338296
H  3.612596 -3.40254 -0.781009
H  3.733576 -4.044305 3.408833
elementType: O N C H
totalener: -1071.53996342 hartree
nucrepener: 1918.07948266 hartree
electener: -2989.61944608 hartree
oneelecener: -5268.59568533 hartree
twoeener: 2278.97623924 hartree
cpcmener: -0.04803563 hartree
kineticenergy: 1066.85905437 hartree
xcener: -102.624167399828 hartree
chargesum: 0.0000000
charge: -0.281712 -0.501424 -0.474467 -0.517863 -0.132623 -0.149177 0.154861 -0.015048 -0.085417 -0.284535 -0.280010 -0.306639 0.405825 -0.001196 -0.228816 -0.252974 0.081066 0.316764 0.405370 0.004567 -0.039536 -0.429969 0.054236 0.102123 0.093003 0.099710 0.093627 0.098147 0.095708 0.101227 0.091765 0.124768 0.089540 0.097111 0.095463 0.084589 0.103915 0.101619 0.134947 0.136031 0.128243 0.126925 0.143585 0.129557 0.287112
qa: -0.2817 -0.5014 -0.4745 -0.5179 -0.1326 -0.1492 0.1549 -0.0150 -0.0854 -0.2845 -0.2800 -0.3066 0.4058 -0.0012 -0.2288 -0.2530 0.0811 0.3168 0.4054 0.0046 -0.0395 -0.4300 0.0542 0.1021 0.0930 0.0997 0.0936 0.0981 0.0957 0.1012 0.0918 0.1248 0.0895 0.0971 0.0955 0.0846 0.1039 0.1016 0.1349 0.1360 0.1282 0.1269 0.1436 0.1296 0.2871
va: 2.1044 1.9943 2.0376 1.9980 3.1603 3.2110 3.6988 3.8177 3.8330 3.9120 3.8889 3.9003 4.0905 3.6946 3.9320 3.9414 3.8904 4.1753 4.2828 3.8965 3.8896 3.7389 3.5763 1.0250 1.0298 0.9995 1.0012 1.0028 1.0008 0.9987 1.0179 1.0033 1.0061 0.9961 0.9954 1.0115 0.9977 1.0005 1.0034 1.0027 1.0058 1.0072 0.9847 1.0091 0.9458
dispcorr: -0.020512843 hartree
energy: -1071.560476265624
dipole: -28.99586 30.28105 1.28519 -0.69691 -0.72201 -1.41893 6.56396 -5.23290 1.33106
magnitude: 2.33169 au
magnitude: 5.92668 debye
