program: Orca
programVersion: 5.0.2
elementType: O O O O N N C C C C C C C C C C C C C C C C C H H H H H H H H H H H H H H H H H H H H H H
charge: 0
multiplicity: 1
keywords: wb97x-d3
keywords: def2-TZVPP
keywords: def2/J RIJCOSX
keywords: DEFGRID2
keywords: scfconv7
keywords: smallprint printgap noloewdin
keywords: NOSOSCF
formula: C17H22N2O4
InChI: InChI=1/C17H22N2O4/c1-6-7-18-9-13(20)19(16(18)22)10-23-15(21)14-12(8-11(2)3)17(14,4)5/h1,8,12,14H,7,9-10H2,2-5H3
45 atoms
O  0.451337 1.071627 0.796933
O  -0.567214 2.261969 -0.813285
O  1.682151 0.387612 -2.169296
O  3.691477 -0.004538 1.895317
N  2.556622 0.529247 -0.052993
N  4.109243 -1.042514 -0.118417
C  -3.072336 1.533037 0.966541
C  -3.077683 0.734898 -0.301071
C  -1.829156 0.75709 0.551723
C  -3.798756 0.996782 2.175162
C  -3.108528 3.037629 0.870598
C  -3.835123 -0.531509 -0.433544
C  -0.621933 1.450552 0.078568
C  -4.912389 -0.716152 -1.202729
C  -5.59637 -2.048038 -1.269337
C  -5.538862 0.352614 -2.044677
C  1.732226 1.579242 0.461642
C  2.448387 0.009776 -1.31607
C  3.489595 -0.177991 0.713514
C  3.452172 -1.105556 -1.402813
C  4.940205 -2.117888 0.3698
C  4.167918 -3.27644 0.813059
C  3.528152 -4.227963 1.171054
H  -3.012967 1.339639 -1.200313
H  -1.634468 -0.130165 1.144316
H  -3.716315 -0.085288 2.270491
H  -3.401215 1.441519 3.089044
H  -4.860415 1.246124 2.121333
H  -2.579257 3.498582 1.706793
H  -2.68207 3.421001 -0.053547
H  -4.145437 3.376071 0.912871
H  -3.478587 -1.371993 0.155247
H  -6.640938 -1.967611 -0.957749
H  -5.609841 -2.42997 -2.293441
H  -5.112151 -2.792781 -0.638018
H  -5.566507 0.053453 -3.095465
H  -6.578011 0.50964 -1.744278
H  -5.030861 1.313016 -1.982333
H  1.671796 2.384634 -0.266461
H  2.184369 1.962638 1.372299
H  2.936813 -2.057786 -1.559927
H  4.143939 -0.946601 -2.231574
H  5.563231 -1.748075 1.184245
H  5.6226 -2.412258 -0.428295
H  2.958914 -5.069214 1.498952
elementType: O N C H
totalener: -1071.54028119 hartree
nucrepener: 1908.95511657 hartree
electener: -2980.49539775 hartree
oneelecener: -5250.78134019 hartree
twoeener: 2270.28594244 hartree
cpcmener: -0.05393178 hartree
kineticenergy: 1066.85978592 hartree
xcener: -102.623498427598 hartree
chargesum: 0.0000000
charge: -0.281792 -0.481182 -0.475813 -0.511549 -0.108959 -0.174266 0.144372 0.014896 -0.148863 -0.262587 -0.289135 -0.281251 0.440478 -0.033806 -0.226933 -0.251435 0.062317 0.320129 0.408397 0.009727 -0.047937 -0.433267 0.058161 0.095456 0.094533 0.090349 0.098880 0.096804 0.101516 0.092101 0.096984 0.124798 0.093711 0.095021 0.090002 0.096859 0.096484 0.089041 0.143236 0.132994 0.127868 0.125744 0.137753 0.141454 0.288709
qa: -0.2818 -0.4812 -0.4758 -0.5115 -0.1090 -0.1743 0.1444 0.0149 -0.1489 -0.2626 -0.2891 -0.2813 0.4405 -0.0338 -0.2269 -0.2514 0.0623 0.3201 0.4084 0.0097 -0.0479 -0.4333 0.0582 0.0955 0.0945 0.0903 0.0989 0.0968 0.1015 0.0921 0.0970 0.1248 0.0937 0.0950 0.0900 0.0969 0.0965 0.0890 0.1432 0.1330 0.1279 0.1257 0.1378 0.1415 0.2887
va: 2.1129 2.0252 2.0354 2.0061 3.1274 3.1975 3.6738 3.7655 3.8904 3.9059 3.9058 3.8708 4.1420 3.7157 3.9246 3.9448 3.8803 4.1688 4.2901 3.9025 3.9054 3.7401 3.5812 1.0281 1.0383 1.0030 1.0028 1.0029 0.9992 1.0170 1.0007 1.0069 0.9964 0.9954 1.0079 0.9975 0.9973 1.0084 1.0154 1.0140 1.0051 1.0077 0.9986 0.9869 0.9444
dispcorr: -0.020264888 hartree
energy: -1071.560546074779
dipole: -36.34563 36.82951 0.48388 -0.82453 -0.76084 -1.58537 -0.57322 0.58347 0.01025
magnitude: 1.65760 au
magnitude: 4.21328 debye
