program: Orca
programVersion: 5.0.2
elementType: O O O O N N C C C C C C C C C C C C C C C C C H H H H H H H H H H H H H H H H H H H H H H
charge: 0
multiplicity: 1
keywords: wb97x-d3
keywords: def2-TZVPP
keywords: def2/J RIJCOSX
keywords: DEFGRID2
keywords: scfconv7
keywords: smallprint printgap noloewdin
keywords: NOSOSCF
formula: C17H22N2O4
InChI: InChI=1/C17H22N2O4/c1-6-7-18-9-13(20)19(16(18)22)10-23-15(21)14-12(8-11(2)3)17(14,4)5/h1,8,12,14H,7,9-10H2,2-5H3
45 atoms
O  0.04548 0.720423 1.157252
O  0.194412 2.287357 -0.427249
O  3.208979 2.544306 -0.067618
O  2.024684 -1.696157 1.119847
N  2.372339 0.563616 0.765271
N  3.63863 -0.902669 -0.317124
C  -2.122649 -0.492293 -0.670948
C  -2.757169 0.211971 0.490284
C  -1.746762 0.95058 -0.367436
C  -2.916208 -0.700606 -1.938059
C  -1.1653 -1.624501 -0.388359
C  -4.161777 0.672327 0.469289
C  -0.422894 1.389366 0.098298
C  -5.107168 0.370219 1.364843
C  -6.494633 0.922552 1.230135
C  -4.9028 -0.516705 2.554225
C  1.341622 1.034198 1.642981
C  3.162875 1.339658 -0.048503
C  2.61967 -0.797098 0.567331
C  3.960919 0.383308 -0.889883
C  3.846175 -2.126985 -1.059133
C  2.812185 -2.338187 -2.070777
C  1.936655 -2.494428 -2.8786
H  -2.383781 -0.111145 1.455586
H  -2.167982 1.66725 -1.064001
H  -3.546981 0.150482 -2.191158
H  -2.24645 -0.876686 -2.781857
H  -3.560933 -1.576484 -1.840838
H  -1.694328 -2.573455 -0.49663
H  -0.334248 -1.633048 -1.097623
H  -0.75772 -1.602037 0.618624
H  -4.439592 1.317765 -0.359184
H  -7.232085 0.119155 1.157654
H  -6.767733 1.511364 2.109801
H  -6.601404 1.559571 0.352459
H  -5.122184 0.021589 3.479709
H  -5.595981 -1.361024 2.520037
H  -3.896315 -0.922265 2.634146
H  1.470481 2.103957 1.797851
H  1.41456 0.52961 2.602054
H  3.640032 0.465207 -1.93335
H  5.027215 0.605362 -0.83801
H  3.873045 -2.969875 -0.368492
H  4.829716 -2.081076 -1.526718
H  1.171924 -2.63809 -3.60908
elementType: O N C H
totalener: -1071.53926691 hartree
nucrepener: 1989.76845675 hartree
electener: -3061.30772366 hartree
oneelecener: -5412.35445956 hartree
twoeener: 2351.04673590 hartree
cpcmener: -0.05523481 hartree
kineticenergy: 1066.86234149 hartree
xcener: -102.624630648975 hartree
chargesum: -0.0000000
charge: -0.271360 -0.485490 -0.466465 -0.503996 -0.102453 -0.166918 0.139740 0.067635 -0.151256 -0.272618 -0.291728 -0.305641 0.446096 -0.039842 -0.223881 -0.253979 0.055935 0.310114 0.385594 0.004989 -0.022589 -0.422161 0.025984 0.104831 0.090724 0.089911 0.099772 0.096405 0.099060 0.090600 0.086207 0.122642 0.094228 0.094153 0.089398 0.096423 0.096454 0.089597 0.137912 0.147456 0.127624 0.123519 0.136721 0.141924 0.288727
qa: -0.2714 -0.4855 -0.4665 -0.5040 -0.1025 -0.1669 0.1397 0.0676 -0.1513 -0.2726 -0.2917 -0.3056 0.4461 -0.0398 -0.2239 -0.2540 0.0559 0.3101 0.3856 0.0050 -0.0226 -0.4222 0.0260 0.1048 0.0907 0.0899 0.0998 0.0964 0.0991 0.0906 0.0862 0.1226 0.0942 0.0942 0.0894 0.0964 0.0965 0.0896 0.1379 0.1475 0.1276 0.1235 0.1367 0.1419 0.2887
va: 2.1099 2.0188 2.0412 2.0064 3.1058 3.1939 3.6272 3.7378 3.8887 3.9166 3.9109 3.8559 4.1365 3.7486 3.9222 3.9445 3.9075 4.1796 4.3076 3.9040 3.9146 3.7302 3.6097 1.0197 1.0354 1.0054 1.0004 1.0021 1.0040 1.0027 1.0224 1.0095 0.9962 0.9959 1.0085 0.9970 0.9973 1.0100 1.0136 1.0006 1.0029 1.0095 0.9982 0.9882 0.9458
dispcorr: -0.023137784 hartree
energy: -1071.562404697249
dipole: -32.06405 32.29874 0.23469 -7.90421 6.27309 -1.63111 -0.21241 -0.17100 -0.38341
magnitude: 1.69193 au
magnitude: 4.30054 debye
