program: Gaussian 09
title: 000067567
version: EM64L-G09RevD.01
frameworkgroup: C1[X(C6H2F3NO2)]
method: RPBEPBE
basis: SDD
operation: Freq
keyword: #p
keyword: freq=noraman
keyword: PBEPBE/SDD
title: #p freq=noraman PBEPBE/SDD
converged: NO NO NO NO
title: Mulliken charges:
elementType: F F F O O N C C C C C C H H
charge: -0.139749 -0.139756 -0.171801 -0.172200 -0.172210 0.038975 0.051513 0.339842 0.339877 -0.509026 -0.509022 0.434882 0.304337 0.304338
chargesum: 0.00000
title: Mulliken charges with hydrogens summed into heavy atoms:
elementType: F F F O O N C C C C C C
charge: -0.139749 -0.139756 -0.171801 -0.172200 -0.172210 0.038975 0.051513 0.339842 0.339877 -0.204689 -0.204684 0.434882
polarizability: 1.16210635e+02 -1.10986781e-03 9.57091398e+01 1.13562010e-02 -8.72492735e-03 3.13106306e+01
1716.lowfreq: -76.7783 -7.3437 -4.6205 -4.2191 -0.0011 -0.0009 0.0004 70.9118 194.3125
frequency: -76.7631 70.9091 194.3123 224.4297 226.7680 301.6257 301.7262 316.8804 343.9211 377.7621 498.6344 537.3502 566.4343 580.2021 597.8867 614.2117 646.3225 717.1755 767.0058 834.3219 852.7090 979.0873 997.5758 1076.1445 1115.3560 1184.0326 1186.0665 1308.0160 1355.3223 1384.0893 1441.5262 1444.6181 1597.6382 1616.5504 3204.4447 3205.3824
redmass: 15.5032 17.0966 14.2642 5.1343 14.9992 14.6644 8.7448 16.3558 16.5345 13.5771 7.9628 14.9824 4.2271 8.5045 7.1259 5.6815 3.3329 8.4231 11.4212 1.4441 1.6604 5.3171 11.4831 8.1459 1.6089 13.6877 1.4206 12.3171 8.2602 10.8156 6.5145 4.2313 9.5680 7.7081 1.0939 1.0946
irintensity: 0.0000 0.9378 3.0995 0.0001 0.9912 4.3786 0.5078 2.1293 0.0846 0.0106 8.0588 0.5612 0.0000 20.3926 1.1423 1.8021 15.7194 0.8792 23.7816 0.0000 85.9778 43.7238 79.1097 42.5042 13.9476 299.9052 4.5826 8.5815 34.3520 3.7835 130.2249 4.6268 158.7239 292.9612 9.4338 2.7207
temp: 298.150 k
press: 1.00000 atm
elementType: 9 9 9 8 8 7 6 6 6 6 6 6 1 1
symmnumber: 1
zpe: 195388.7 jmol-1
zpe.correction: 0.074420 hartree
zpe.thermalcorrener: 0.083354 hartree
zpe.thermalcorrenthalpy: 0.084298 hartree
zpe.thermalcorrgfe: 0.039814 hartree
zpe.sumelectzpe: -733.587941 hartree
zpe.sumelectthermal: -733.579007 hartree
zpe.sumelectthermalent: -733.578062 hartree
zpe.sumelectthermalfe: -733.622546 hartree
dipole: 4.6695 -0.0001 0.0044
dipole: 4.6695
quadrupole: -79.0022 -67.8864 -63.9862
quadrupole: 0.0004 -0.0122 0.0032
quadrupole: -8.7106 2.4052 6.3054 0.0004 -0.0122 0.0032
hfenergy: -733.6623602 hartree
pointgroup: C01[X(C6H2F3N1O2)]
dipole: -1.8371246 0.0000046 0.0017178 debye
dipolederiv: -0.2727764 -0.2204171 -0.000089 -0.2053091 -0.7726095 -0.0001363 0.0000519 -0.0000787 -0.1047371 -0.2727418 0.2204239 -0.000203 0.2052943 -0.7726917 0.0002832 -0.0000542 0.0002629 -0.1047436 -1.1546191 0.0000273 -0.0002239 0.0000365 -0.2072052 0.0000068 -0.0003696 0.0000006 -0.1392695 -0.6248607 -0.2032141 -0.000277 -0.1534429 -0.5932672 -0.0010898 0.0006164 0.000836 -0.2075956 -0.6249104 0.2032391 -0.000023 0.1534737 -0.593266 0.0004082 0.0006636 -0.0014748 -0.2076062 1.7973928 -0.000039 -0.0003643 -0.0000254 1.0882838 0.0008267 -0.0001052 0.0006789 0.2210559 -0.8864899 -0.0000012 0.0004845 -0.0000245 -0.3380159 -0.000078 -0.0007555 -0.0000496 -0.0146459 0.7463613 0.2971515 0.0002173 -0.066549 0.9474883 0.000196 -0.0003121 -0.0000237 0.1727662 0.7463385 -0.2971622 0.0003204 0.066572 0.9476162 -0.0004237 0.0000424 -0.0001748 0.1727792 -0.547065 -0.2528605 -0.0000487 -0.215042 -0.2591904 -0.0000853 -0.0001418 -0.000107 -0.1825049 -0.547052 0.2528808 -0.0000998 0.2150579 -0.2592201 0.0001113 -0.0001717 0.0001375 -0.1825082 1.4537418 -0.0000251 0.0003332 -0.0000418 0.6523745 -0.0000345 0.0004243 -0.0000279 0.1550852 0.0933418 0.0118384 -0.0000144 0.014604 0.0798513 0.0000247 0.0000637 0.0000735 0.2109624 0.093339 -0.0118418 -0.0000123 -0.0146037 0.0798518 -0.0000093 0.0000478 -0.0000526 0.210962 unknown
polarizability: 116.2106348|-0.0008232|95.7091398|-0.0113563|0.0087248|31.3106306 unknown
InChI: InChI=1S/C6H2F3NO2/c7-3-1-4(8)6(10(11)12)5(9)2-3/h1-2H
charge 0 multiplicity 1
14 atoms
F  0.493735 2.452195 0.000485
F  0.493502 -2.452337 0.00079
F  -3.595042 0.000097 -0.000671
O  2.717113 1.137623 -0.000676
O  2.717293 -1.137523 -0.002223
N  2.112198 0.000005 0.001366
C  0.626813 -0.000051 0.000826
C  -0.127232 1.210979 0.000454
C  -0.127313 -1.211048 0.000537
C  -1.530289 1.232382 -0.000028
C  -1.530373 -1.232342 0.000082
C  -2.198943 0.000042 -0.00019
H  -2.069207 2.18174 -0.000282
H  -2.069356 -2.181663 -0.000071
