program: Orca
programVersion: 5.0.2
elementType: O O O O N N C C C C C C C C C C C C C C C C C H H H H H H H H H H H H H H H H H H H H H H
charge: 0
multiplicity: 1
keywords: wb97x-d3
keywords: def2-TZVPP
keywords: def2/J RIJCOSX
keywords: DEFGRID2
keywords: scfconv7
keywords: smallprint printgap noloewdin
keywords: NOSOSCF
formula: C17H22N2O4
InChI: InChI=1/C17H22N2O4/c1-6-7-18-9-13(20)19(16(18)22)10-23-15(21)14-12(8-11(2)3)17(14,4)5/h1,8,12,14H,7,9-10H2,2-5H3
45 atoms
O  0.416193 1.978835 0.936539
O  0.150689 1.183892 -1.138347
O  1.789576 -0.081126 2.750801
O  3.201295 0.818433 -1.487538
N  2.398813 0.714743 0.686312
N  3.445087 -1.043498 -0.159199
C  -2.883283 1.749901 -0.701647
C  -2.628451 0.362965 -0.20566
C  -1.752577 1.5174 0.282673
C  -4.052486 2.539938 -0.16142
C  -2.607775 2.051527 -2.155052
C  -3.50324 -0.322395 0.761902
C  -0.332443 1.535531 -0.08813
C  -3.764882 -1.633479 0.809785
C  -4.69772 -2.186601 1.845136
C  -3.202891 -2.657674 -0.12904
C  1.823271 2.025156 0.780393
C  2.293805 -0.238241 1.664819
C  3.032171 0.211254 -0.454436
C  2.909032 -1.489637 1.104856
C  3.796462 -1.978701 -1.203727
C  2.622096 -2.516784 -1.887408
C  1.644771 -2.955702 -2.430651
H  -2.13586 -0.274381 -0.931916
H  -1.953973 1.855413 1.292624
H  -3.905546 3.604571 -0.351185
H  -4.977063 2.240537 -0.658445
H  -4.194537 2.417827 0.911375
H  -2.254729 3.076118 -2.285865
H  -1.880936 1.381137 -2.60638
H  -3.535903 1.95143 -2.720731
H  -3.976992 0.31074 1.506237
H  -4.188663 -2.914843 2.481722
H  -5.111561 -1.40827 2.485854
H  -5.531033 -2.717414 1.377292
H  -3.98515 -3.03998 -0.791763
H  -2.391821 -2.28689 -0.754163
H  -2.825069 -3.518522 0.428635
H  2.117894 2.602081 -0.094859
H  2.189666 2.528654 1.671135
H  3.681293 -1.881312 1.768334
H  2.136207 -2.255076 0.983501
H  4.374244 -2.789068 -0.758677
H  4.456321 -1.488534 -1.919579
H  0.783065 -3.34899 -2.922256
elementType: O N C H
totalener: -1071.53984457 hartree
nucrepener: 1983.06623655 hartree
electener: -3054.60608111 hartree
oneelecener: -5399.37816727 hartree
twoeener: 2344.77208616 hartree
cpcmener: -0.05605876 hartree
kineticenergy: 1066.86242662 hartree
xcener: -102.624263506926 hartree
chargesum: 0.0000000
charge: -0.287382 -0.490941 -0.474167 -0.503873 -0.118364 -0.170551 0.114630 0.024723 -0.106977 -0.277980 -0.278856 -0.277092 0.438912 -0.044799 -0.218911 -0.255301 0.074887 0.308013 0.400300 0.003174 -0.035442 -0.431681 0.047004 0.104123 0.090838 0.097730 0.098904 0.091355 0.100280 0.091152 0.095826 0.119755 0.094692 0.089247 0.092938 0.101509 0.090593 0.093742 0.136887 0.151457 0.124680 0.128631 0.141292 0.137524 0.287518
qa: -0.2874 -0.4909 -0.4742 -0.5039 -0.1184 -0.1706 0.1146 0.0247 -0.1070 -0.2780 -0.2789 -0.2771 0.4389 -0.0448 -0.2189 -0.2553 0.0749 0.3080 0.4003 0.0032 -0.0354 -0.4317 0.0470 0.1041 0.0908 0.0977 0.0989 0.0914 0.1003 0.0912 0.0958 0.1198 0.0947 0.0892 0.0929 0.1015 0.0906 0.0937 0.1369 0.1515 0.1247 0.1286 0.1413 0.1375 0.2875
va: 2.1115 2.0151 2.0347 2.0111 3.1090 3.1837 3.6810 3.8018 3.8242 3.9159 3.8966 3.8874 4.1152 3.7549 3.9204 3.9396 3.8883 4.1819 4.3046 3.9105 3.9065 3.7271 3.5946 1.0199 1.0358 1.0012 1.0007 1.0067 0.9995 1.0202 0.9995 1.0112 0.9967 1.0087 0.9952 0.9953 1.0102 0.9977 1.0167 0.9921 1.0087 1.0035 0.9876 0.9989 0.9459
dispcorr: -0.021244768 hartree
energy: -1071.561089335179
dipole: -31.05449 30.86510 -0.18938 -5.78569 4.42628 -1.35941 -1.52124 2.24278 0.72154
magnitude: 1.55063 au
magnitude: 3.94140 debye
