program: Orca
programVersion: 5.0.2
elementType: O O O O N N C C C C C C C C C C C C C C C C C H H H H H H H H H H H H H H H H H H H H H H
charge: 0
multiplicity: 1
keywords: wb97x-d3
keywords: def2-TZVPP
keywords: def2/J RIJCOSX
keywords: DEFGRID2
keywords: scfconv7
keywords: smallprint printgap noloewdin
keywords: NOSOSCF
formula: C17H22N2O4
InChI: InChI=1/C17H22N2O4/c1-6-7-18-9-13(20)19(16(18)22)10-23-15(21)14-12(8-11(2)3)17(14,4)5/h1,8,12,14H,7,9-10H2,2-5H3
45 atoms
O  0.544143 1.731177 1.303615
O  0.319237 1.621817 -0.918983
O  3.419062 1.901053 -1.324251
O  2.066196 -0.667277 2.184497
N  2.652506 0.921201 0.612309
N  3.335809 -1.169645 0.325711
C  -2.74486 1.513234 -0.326402
C  -2.248282 0.106425 -0.373196
C  -1.538507 1.11319 0.510262
C  -3.993701 1.814601 0.464038
C  -2.595483 2.385158 -1.547656
C  -2.965916 -1.024241 0.271653
C  -0.164183 1.514144 0.183046
C  -4.03101 -1.638013 -0.248519
C  -4.6958 -2.778556 0.458077
C  -4.649679 -1.247147 -1.55428
C  1.927342 2.015364 1.190307
C  3.253856 0.93495 -0.621137
C  2.62461 -0.365227 1.153115
C  3.670741 -0.481206 -0.899779
C  3.137775 -2.602768 0.33739
C  1.921015 -2.994187 -0.370951
C  0.921997 -3.278406 -0.97519
H  -1.704717 -0.142059 -1.281727
H  -1.73465 1.020648 1.572548
H  -4.882124 1.606464 -0.135542
H  -4.063973 1.225156 1.37697
H  -4.023789 2.868925 0.74341
H  -3.520587 2.351394 -2.126133
H  -2.421609 3.426548 -1.272364
H  -1.790925 2.069364 -2.206893
H  -2.580934 -1.369741 1.226467
H  -4.696492 -3.678165 -0.161818
H  -4.207066 -3.018369 1.401814
H  -5.743112 -2.547665 0.667616
H  -5.700477 -0.981276 -1.417148
H  -4.149652 -0.406528 -2.032579
H  -4.636384 -2.087275 -2.252884
H  2.112372 2.906833 0.593172
H  2.263892 2.197427 2.206823
H  3.107081 -0.862006 -1.757102
H  4.734333 -0.540908 -1.132759
H  3.108461 -2.953498 1.36816
H  4.004326 -3.075853 -0.124594
H  0.029219 -3.533464 -1.49976
elementType: O N C H
totalener: -1071.53783525 hartree
nucrepener: 2000.84873325 hartree
electener: -3072.38656850 hartree
oneelecener: -5434.82556692 hartree
twoeener: 2362.43899841 hartree
cpcmener: -0.05107738 hartree
kineticenergy: 1066.89504355 hartree
xcener: -102.629116378506 hartree
chargesum: -0.0000000
charge: -0.287670 -0.488618 -0.468628 -0.504225 -0.122759 -0.170031 0.097050 -0.018328 -0.073060 -0.279613 -0.294072 -0.250064 0.417989 -0.042030 -0.228520 -0.254715 0.086698 0.312353 0.390783 -0.001178 -0.025165 -0.424412 0.034832 0.109020 0.094383 0.097441 0.092934 0.103953 0.094995 0.105621 0.093843 0.122372 0.095646 0.090560 0.095049 0.098962 0.089543 0.107047 0.135097 0.151996 0.128089 0.125196 0.135755 0.140837 0.285047
qa: -0.2877 -0.4886 -0.4686 -0.5042 -0.1228 -0.1700 0.0971 -0.0183 -0.0731 -0.2796 -0.2941 -0.2501 0.4180 -0.0420 -0.2285 -0.2547 0.0867 0.3124 0.3908 -0.0012 -0.0252 -0.4244 0.0348 0.1090 0.0944 0.0974 0.0929 0.1040 0.0950 0.1056 0.0938 0.1224 0.0956 0.0906 0.0950 0.0990 0.0895 0.1070 0.1351 0.1520 0.1281 0.1252 0.1358 0.1408 0.2850
va: 2.1102 2.0170 2.0419 2.0089 3.1046 3.1967 3.7162 3.8097 3.8144 3.9111 3.8892 3.8471 4.1473 3.7156 3.9248 3.9310 3.8799 4.1711 4.3202 3.9073 3.9069 3.7266 3.6119 1.0204 1.0345 0.9985 1.0030 1.0032 1.0002 0.9996 1.0200 1.0055 0.9958 1.0070 0.9962 0.9968 1.0063 1.0007 1.0165 0.9917 1.0042 1.0098 1.0015 0.9880 0.9485
dispcorr: -0.022978539 hartree
energy: -1071.560813792216
dipole: -34.27532 33.96002 -0.31530 -5.38460 4.04519 -1.33941 -5.74004 5.63879 -0.10126
magnitude: 1.37974 au
magnitude: 3.50703 debye
