program: Orca
programVersion: 5.0.2
elementType: O O O O N N C C C C C C C C C C C C C C C C C H H H H H H H H H H H H H H H H H H H H H H
charge: 0
multiplicity: 1
keywords: wb97x-d3
keywords: def2-TZVPP
keywords: def2/J RIJCOSX
keywords: DEFGRID2
keywords: scfconv7
keywords: smallprint printgap noloewdin
keywords: NOSOSCF
formula: C17H22N2O4
InChI: InChI=1/C17H22N2O4/c1-6-7-18-9-13(20)19(16(18)22)10-23-15(21)14-12(8-11(2)3)17(14,4)5/h1,8,12,14H,7,9-10H2,2-5H3
45 atoms
O  0.545631 1.744138 1.304743
O  0.32688 1.642349 -0.919043
O  3.428561 1.897766 -1.314425
O  2.050515 -0.66171 2.191147
N  2.651066 0.923058 0.620812
N  3.315939 -1.173521 0.332416
C  -2.740256 1.510096 -0.337069
C  -2.231964 0.10713 -0.376314
C  -1.532952 1.123661 0.504653
C  -3.99429 1.804578 0.448628
C  -2.594824 2.377377 -1.562437
C  -2.942134 -1.027077 0.270945
C  -0.159388 1.530624 0.181672
C  -3.995849 -1.656555 -0.254133
C  -4.653401 -2.800508 0.454381
C  -4.607226 -1.282101 -1.568477
C  1.930801 2.021603 1.197569
C  3.254294 0.932509 -0.612459
C  2.611639 -0.363204 1.15992
C  3.657794 -0.487074 -0.892136
C  3.10357 -2.605048 0.342306
C  1.877249 -2.981043 -0.358587
C  0.872645 -3.255928 -0.957502
H  -1.684102 -0.141048 -1.282628
H  -1.731956 1.034192 1.566798
H  -4.034787 2.860626 0.721479
H  -4.879697 1.584395 -0.151617
H  -4.061229 1.220109 1.36533
H  -3.518571 2.333394 -2.142751
H  -2.429745 3.421768 -1.29153
H  -1.786379 2.065039 -2.218727
H  -2.561979 -1.36142 1.232125
H  -4.168353 -3.030188 1.402966
H  -5.704765 -2.580002 0.656153
H  -4.640329 -3.703876 -0.160485
H  -4.112923 -0.438689 -2.048266
H  -4.577084 -2.127029 -2.261461
H  -5.662706 -1.027692 -1.443711
H  2.123689 2.912538 0.601587
H  2.264142 2.200856 2.215961
H  3.090157 -0.861585 -1.750137
H  4.720735 -0.557565 -1.126249
H  3.076068 -2.957573 1.372863
H  3.963436 -3.08569 -0.124862
H  -0.021696 -3.509396 -1.482117
elementType: O N C H
totalener: -1071.53778933 hartree
nucrepener: 2002.83574699 hartree
electener: -3074.37353632 hartree
oneelecener: -5438.80731992 hartree
twoeener: 2364.43378360 hartree
cpcmener: -0.05118669 hartree
kineticenergy: 1066.87864922 hartree
xcener: -102.625816266640 hartree
chargesum: 0.0000000
charge: -0.287281 -0.488765 -0.468090 -0.504705 -0.123233 -0.169875 0.098799 -0.018822 -0.072250 -0.279798 -0.294353 -0.251220 0.417071 -0.042014 -0.228477 -0.254586 0.086820 0.311982 0.390646 -0.000985 -0.024775 -0.425394 0.036099 0.109021 0.094342 0.103857 0.097500 0.092966 0.095001 0.105595 0.093754 0.122646 0.090591 0.095152 0.095535 0.089562 0.106884 0.099038 0.135114 0.152011 0.128197 0.125229 0.135982 0.140904 0.284326
qa: -0.2873 -0.4888 -0.4681 -0.5047 -0.1232 -0.1699 0.0988 -0.0188 -0.0722 -0.2798 -0.2944 -0.2512 0.4171 -0.0420 -0.2285 -0.2546 0.0868 0.3120 0.3906 -0.0010 -0.0248 -0.4254 0.0361 0.1090 0.0943 0.1039 0.0975 0.0930 0.0950 0.1056 0.0938 0.1226 0.0906 0.0952 0.0955 0.0896 0.1069 0.0990 0.1351 0.1520 0.1282 0.1252 0.1360 0.1409 0.2843
va: 2.1102 2.0167 2.0424 2.0084 3.1048 3.1961 3.7187 3.8086 3.8153 3.9110 3.8890 3.8452 4.1478 3.7158 3.9249 3.9311 3.8802 4.1712 4.3206 3.9074 3.9064 3.7274 3.6123 1.0201 1.0345 1.0031 0.9985 1.0029 1.0001 0.9996 1.0200 1.0055 1.0070 0.9962 0.9958 1.0063 1.0006 0.9969 1.0163 0.9917 1.0041 1.0097 1.0013 0.9881 0.9490
dispcorr: -0.023061231 hartree
energy: -1071.560850563993
dipole: -34.14069 33.82001 -0.32068 -5.58572 4.21994 -1.36578 -5.85573 5.74346 -0.11227
magnitude: 1.40741 au
magnitude: 3.57734 debye
