program: Orca
programVersion: 5.0.2
elementType: O O O O N N C C C C C C C C C C C C C C C C C H H H H H H H H H H H H H H H H H H H H H H
charge: 0
multiplicity: 1
keywords: wb97x-d3
keywords: def2-TZVPP
keywords: def2/J RIJCOSX
keywords: DEFGRID2
keywords: scfconv7
keywords: smallprint printgap noloewdin
keywords: NOSOSCF
formula: C17H22N2O4
InChI: InChI=1/C17H22N2O4/c1-6-7-18-9-13(20)19(16(18)22)10-23-15(21)14-12(8-11(2)3)17(14,4)5/h1,8,12,14H,7,9-10H2,2-5H3
45 atoms
O  0.379517 0.916488 0.931449
O  -0.631715 -0.733824 2.066993
O  3.654345 2.448859 0.373534
O  1.739651 -1.606501 -0.429379
N  2.541577 0.436919 0.295318
N  3.190912 -0.323082 -1.678894
C  -2.569992 -0.498984 -0.428334
C  -3.22857 0.040387 0.805953
C  -1.844586 0.526211 0.432552
C  -3.015742 -0.017838 -1.787384
C  -2.123467 -1.940236 -0.434285
C  -4.348901 1.000791 0.749784
C  -0.675923 0.144028 1.239126
C  -5.505068 0.919771 1.416125
C  -6.546334 1.988214 1.267143
C  -5.882659 -0.190373 2.34829
C  1.666573 0.569326 1.418675
C  3.407865 1.396155 -0.162742
C  2.426319 -0.623529 -0.60811
C  3.987398 0.857519 -1.441913
C  3.561105 -1.313668 -2.661621
C  4.690799 -2.138206 -2.239075
C  5.617448 -2.820373 -1.894226
H  -3.245472 -0.659138 1.634957
H  -1.782067 1.516032 -0.006105
H  -3.898271 -0.570647 -2.115179
H  -3.262182 1.042767 -1.803649
H  -2.229238 -0.184119 -2.525577
H  -2.904435 -2.559766 -0.878779
H  -1.22151 -2.068744 -1.036175
H  -1.926215 -2.334756 0.559967
H  -4.203759 1.859292 0.100404
H  -6.775243 2.448846 2.231752
H  -6.232448 2.777024 0.583861
H  -7.485606 1.571042 0.895004
H  -6.825914 -0.644838 2.033858
H  -5.140708 -0.984387 2.412944
H  -6.05034 0.195217 3.357754
H  2.032465 1.37029 2.056596
H  1.649245 -0.356999 1.987641
H  3.899843 1.585734 -2.249311
H  5.047148 0.623446 -1.299388
H  3.806665 -0.799415 -3.59149
H  2.697357 -1.942759 -2.8771
H  6.439691 -3.42644 -1.585011
elementType: O N C H
totalener: -1071.54058444 hartree
nucrepener: 1921.75138446 hartree
electener: -2993.29196890 hartree
oneelecener: -5276.19068205 hartree
twoeener: 2282.89871316 hartree
cpcmener: -0.05146327 hartree
kineticenergy: 1066.86150623 hartree
xcener: -102.623756434064 hartree
chargesum: 0.0000000
charge: -0.283170 -0.475717 -0.473650 -0.514603 -0.113056 -0.160793 0.113194 0.042529 -0.094257 -0.268698 -0.279347 -0.289163 0.395668 -0.046464 -0.219730 -0.253053 0.078969 0.319387 0.410298 -0.001618 -0.043307 -0.435730 0.058337 0.092610 0.093561 0.098257 0.089656 0.098418 0.100369 0.091972 0.094183 0.121736 0.093840 0.088570 0.093820 0.096081 0.090249 0.097627 0.129439 0.142015 0.124614 0.129100 0.142057 0.137531 0.288268
qa: -0.2832 -0.4757 -0.4736 -0.5146 -0.1131 -0.1608 0.1132 0.0425 -0.0943 -0.2687 -0.2793 -0.2892 0.3957 -0.0465 -0.2197 -0.2531 0.0790 0.3194 0.4103 -0.0016 -0.0433 -0.4357 0.0583 0.0926 0.0936 0.0983 0.0897 0.0984 0.1004 0.0920 0.0942 0.1217 0.0938 0.0886 0.0938 0.0961 0.0902 0.0976 0.1294 0.1420 0.1246 0.1291 0.1421 0.1375 0.2883
va: 2.1062 2.0286 2.0388 1.9969 3.1304 3.1889 3.6856 3.7811 3.8355 3.9077 3.8964 3.8736 4.1620 3.7523 3.9203 3.9413 3.8674 4.1712 4.2734 3.9006 3.9054 3.7409 3.5855 1.0314 1.0361 1.0019 1.0053 1.0017 1.0018 1.0100 1.0161 1.0094 0.9958 1.0089 0.9963 0.9971 1.0093 0.9962 1.0135 1.0175 1.0102 1.0019 0.9870 0.9992 0.9447
dispcorr: -0.020682681 hartree
energy: -1071.561267120822
dipole: -35.17343 35.70781 0.53438 -0.85916 1.35175 0.49259 -2.06271 -0.09592 -2.15863
magnitude: 2.27770 au
magnitude: 5.78944 debye
