program: Orca
programVersion: 5.0.2
elementType: O O O O N N C C C C C C C C C C C C C C C C C H H H H H H H H H H H H H H H H H H H H H H
charge: 0
multiplicity: 1
keywords: wb97x-d3
keywords: def2-TZVPP
keywords: def2/J RIJCOSX
keywords: DEFGRID2
keywords: scfconv7
keywords: smallprint printgap noloewdin
keywords: NOSOSCF
formula: C17H22N2O4
InChI: InChI=1/C17H22N2O4/c1-6-7-18-9-13(20)19(16(18)22)10-23-15(21)14-12(8-11(2)3)17(14,4)5/h1,8,12,14H,7,9-10H2,2-5H3
45 atoms
O  0.344326 1.297589 0.320236
O  -0.605905 0.51939 2.200002
O  3.537794 2.611872 -0.940202
O  2.0809 -1.219626 1.039867
N  2.624951 0.897358 0.293341
N  3.874059 -0.808892 -0.354468
C  -2.331786 -1.058452 0.086387
C  -3.136604 0.064298 0.664893
C  -1.754718 0.349972 0.106891
C  -2.669159 -1.605333 -1.279174
C  -1.796965 -2.113366 1.02414
C  -4.309537 0.643806 -0.018532
C  -0.649266 0.707861 1.007945
C  -5.477159 0.974266 0.543817
C  -6.579687 1.572608 -0.277993
C  -5.811361 0.802679 1.994227
C  1.570499 1.585863 0.971635
C  3.486313 1.449522 -0.619297
C  2.79179 -0.486962 0.385945
C  4.343962 0.321157 -1.120503
C  4.173353 -2.167259 -0.742709
C  3.52116 -2.54745 -1.994198
C  3.002022 -2.844429 -3.035893
H  -3.180153 0.056221 1.748533
H  -1.719354 0.835377 -0.861995
H  -3.481869 -2.33067 -1.208533
H  -2.971173 -0.833495 -1.985393
H  -1.805146 -2.119134 -1.704211
H  -0.816131 -2.467974 0.700642
H  -1.710731 -1.770712 2.052711
H  -2.471851 -2.971065 1.02553
H  -4.19685 0.82409 -1.083742
H  -6.879201 2.545945 0.119342
H  -6.291599 1.708549 -1.320217
H  -7.47277 0.942765 -0.253518
H  -5.041263 0.293663 2.569669
H  -5.990236 1.773501 2.463718
H  -6.737494 0.23401 2.106735
H  1.75566 2.655317 0.904951
H  1.552026 1.295211 2.01908
H  4.189322 0.188783 -2.195498
H  5.401599 0.528207 -0.94762
H  3.873515 -2.840363 0.060397
H  5.254675 -2.2715 -0.84537
H  2.536814 -3.110243 -3.958572
elementType: O N C H
totalener: -1071.54091607 hartree
nucrepener: 1931.45056589 hartree
electener: -3002.99148196 hartree
oneelecener: -5295.81963926 hartree
twoeener: 2292.82815730 hartree
cpcmener: -0.05133578 hartree
kineticenergy: 1066.85473687 hartree
xcener: -102.623831436757 hartree
chargesum: 0.0000000
charge: -0.283994 -0.479361 -0.475641 -0.514630 -0.110219 -0.162972 0.108166 0.039517 -0.091932 -0.271450 -0.276277 -0.286551 0.406264 -0.048082 -0.217397 -0.254242 0.070022 0.322470 0.411061 0.001079 -0.040433 -0.435689 0.058123 0.094068 0.092640 0.097906 0.089377 0.098101 0.093059 0.092799 0.099291 0.121676 0.092847 0.088917 0.094194 0.090387 0.098695 0.095236 0.129109 0.145597 0.126787 0.125826 0.135056 0.141888 0.288709
qa: -0.2840 -0.4794 -0.4756 -0.5146 -0.1102 -0.1630 0.1082 0.0395 -0.0919 -0.2715 -0.2763 -0.2866 0.4063 -0.0481 -0.2174 -0.2542 0.0700 0.3225 0.4111 0.0011 -0.0404 -0.4357 0.0581 0.0941 0.0926 0.0979 0.0894 0.0981 0.0931 0.0928 0.0993 0.1217 0.0928 0.0889 0.0942 0.0904 0.0987 0.0952 0.1291 0.1456 0.1268 0.1258 0.1351 0.1419 0.2887
va: 2.1082 2.0252 2.0381 1.9962 3.1238 3.1997 3.6832 3.7809 3.8226 3.9124 3.8979 3.8770 4.1560 3.7590 3.9195 3.9414 3.8690 4.1684 4.2803 3.9050 3.9017 3.7495 3.5814 1.0295 1.0354 1.0017 1.0060 1.0015 1.0083 1.0164 1.0015 1.0102 0.9959 1.0087 0.9963 1.0097 0.9961 0.9974 1.0146 1.0158 1.0062 1.0078 1.0027 0.9865 0.9448
dispcorr: -0.020636997 hartree
energy: -1071.561553068833
dipole: -33.88773 34.81469 0.92696 -5.93591 5.16587 -0.77003 -1.35137 -0.27964 -1.63101
magnitude: 2.02791 au
magnitude: 5.15453 debye
