program: Orca
programVersion: 5.0.2
elementType: O O O O N N C C C C C C C C C C C C C C C C C H H H H H H H H H H H H H H H H H H H H H H
charge: 0
multiplicity: 1
keywords: wb97x-d3
keywords: def2-TZVPP
keywords: def2/J RIJCOSX
keywords: DEFGRID2
keywords: scfconv7
keywords: smallprint printgap noloewdin
keywords: NOSOSCF
formula: C17H22N2O4
InChI: InChI=1/C17H22N2O4/c1-6-7-18-9-13(20)19(16(18)22)10-23-15(21)14-12(8-11(2)3)17(14,4)5/h1,8,12,14H,7,9-10H2,2-5H3
45 atoms
O  -0.088299 -1.11227 0.508561
O  -1.485166 -1.347625 -1.23563
O  1.242654 0.063633 -2.247502
O  3.341134 -1.506554 1.477272
N  2.054816 -0.99403 -0.378152
N  3.851372 0.227007 0.048268
C  -2.417309 1.471203 -0.154208
C  -3.451833 0.4296 0.149455
C  -2.009972 0.17501 0.534225
C  -2.334497 2.717458 0.692575
C  -2.052109 1.722021 -1.59664
C  -4.452683 0.600408 1.22173
C  -1.210991 -0.831226 -0.179859
C  -5.767628 0.375655 1.128867
C  -6.665191 0.596936 2.309102
C  -6.472826 -0.09382 -0.106326
C  0.945547 -1.859596 -0.110776
C  2.085601 -0.074076 -1.393428
C  3.131932 -0.823187 0.499231
C  3.358993 0.702699 -1.220996
C  5.205928 0.478128 0.482067
C  6.190107 -0.242108 -0.32264
C  6.995617 -0.823101 -0.998173
H  -3.78383 -0.12526 -0.721652
H  -1.762476 0.28465 1.58437
H  -1.34574 3.1708 0.602705
H  -3.066551 3.454469 0.356424
H  -2.513525 2.527889 1.749877
H  -2.669811 2.532531 -1.988147
H  -1.009421 2.032077 -1.690006
H  -2.208826 0.858869 -2.239336
H  -4.069032 0.944513 2.177814
H  -7.434869 1.339094 2.081478
H  -7.19409 -0.321478 2.576829
H  -6.116998 0.938223 3.186947
H  -7.013072 -1.023345 0.089158
H  -7.224086 0.637385 -0.415734
H  -5.813074 -0.264655 -0.95437
H  1.263149 -2.631895 0.584147
H  0.615647 -2.328662 -1.034468
H  4.04419 0.481409 -2.045288
H  3.165274 1.776577 -1.214202
H  5.299999 0.20015 1.531796
H  5.397501 1.550765 0.428812
H  7.710489 -1.343428 -1.595878
elementType: O N C H
totalener: -1071.54060950 hartree
nucrepener: 1917.23428055 hartree
electener: -2988.77489005 hartree
oneelecener: -5267.10512034 hartree
twoeener: 2278.33023029 hartree
cpcmener: -0.05216602 hartree
kineticenergy: 1066.86410152 hartree
xcener: -102.624885160864 hartree
chargesum: 0.0000000
charge: -0.283416 -0.473315 -0.476616 -0.511077 -0.112980 -0.168060 0.114988 0.038826 -0.096100 -0.269008 -0.283707 -0.285969 0.401258 -0.050742 -0.218136 -0.251884 0.072391 0.323804 0.404024 0.006946 -0.037642 -0.436117 0.058010 0.094211 0.093956 0.098076 0.097686 0.090155 0.101668 0.092497 0.093983 0.121914 0.093146 0.093768 0.089230 0.095910 0.096700 0.090431 0.132530 0.142701 0.127747 0.124380 0.134779 0.141202 0.287852
qa: -0.2834 -0.4733 -0.4766 -0.5111 -0.1130 -0.1681 0.1150 0.0388 -0.0961 -0.2690 -0.2837 -0.2860 0.4013 -0.0507 -0.2181 -0.2519 0.0724 0.3238 0.4040 0.0069 -0.0376 -0.4361 0.0580 0.0942 0.0940 0.0981 0.0977 0.0902 0.1017 0.0925 0.0940 0.1219 0.0931 0.0938 0.0892 0.0959 0.0967 0.0904 0.1325 0.1427 0.1277 0.1244 0.1348 0.1412 0.2879
va: 2.1099 2.0299 2.0314 2.0077 3.1330 3.1981 3.6802 3.7830 3.8284 3.9073 3.8935 3.8688 4.1648 3.7587 3.9195 3.9411 3.8779 4.1528 4.2960 3.9026 3.9010 3.7409 3.5815 1.0298 1.0354 1.0016 1.0019 1.0056 1.0022 1.0082 1.0170 1.0097 0.9962 0.9962 1.0087 0.9969 0.9970 1.0103 1.0152 1.0152 1.0031 1.0100 1.0031 0.9871 0.9450
dispcorr: -0.020815335 hartree
energy: -1071.561424833048
dipole: -32.64447 33.75548 1.11100 13.98479 -12.18578 1.79902 3.76755 -3.35800 0.40955
magnitude: 2.15372 au
magnitude: 5.47432 debye
