program: Orca
programVersion: 5.0.2
elementType: O O O O N N C C C C C C C C C C C C C C C C C H H H H H H H H H H H H H H H H H H H H H H
charge: 0
multiplicity: 1
keywords: wb97x-d3
keywords: def2-TZVPP
keywords: def2/J RIJCOSX
keywords: DEFGRID2
keywords: scfconv7
keywords: smallprint printgap noloewdin
keywords: NOSOSCF
formula: C17H22N2O4
InChI: InChI=1/C17H22N2O4/c1-6-7-18-9-13(20)19(16(18)22)10-23-15(21)14-12(8-11(2)3)17(14,4)5/h1,8,12,14H,7,9-10H2,2-5H3
45 atoms
O  0.324875 1.739371 0.171597
O  -0.780951 1.783804 -1.781642
O  3.608567 1.259409 1.611202
O  1.113198 -0.91486 -1.521313
N  2.256949 0.490869 -0.083537
N  2.496992 -1.695399 0.148566
C  -3.276903 2.2269 0.093861
C  -3.196583 0.803033 -0.333005
C  -1.970795 1.463328 0.270564
C  -3.993108 2.559843 1.380369
C  -3.397482 3.309351 -0.949716
C  -3.889793 -0.284127 0.406107
C  -0.791908 1.680925 -0.578233
C  -3.345644 -1.449475 0.766973
C  -4.1372 -2.476986 1.51643
C  -1.925739 -1.830515 0.477289
C  1.595882 1.70419 -0.456629
C  3.151148 0.360303 0.948162
C  1.875831 -0.7551 -0.59172
C  3.44744 -1.109297 1.062928
C  2.566861 -3.080035 -0.250975
C  3.682677 -3.353822 -1.153744
C  4.60695 -3.578836 -1.8868
H  -3.131447 0.664269 -1.410067
H  -1.739899 1.191645 1.294013
H  -3.868975 1.788032 2.139998
H  -3.621075 3.497911 1.795788
H  -5.063252 2.680321 1.200542
H  -2.896459 4.223584 -0.625922
H  -2.988477 3.023911 -1.916204
H  -4.451201 3.550625 -1.102468
H  -4.933136 -0.104558 0.652378
H  -3.654509 -2.724386 2.465451
H  -5.151311 -2.140607 1.73085
H  -4.201407 -3.410333 0.951655
H  -1.332562 -1.845182 1.395856
H  -1.879209 -2.841479 0.065854
H  -1.435337 -1.164537 -0.22822
H  1.520521 1.769067 -1.539226
H  2.180018 2.5458 -0.093163
H  4.483892 -1.305217 0.77061
H  3.305433 -1.457434 2.087269
H  1.625002 -3.362474 -0.721512
H  2.658648 -3.694966 0.645233
H  5.424241 -3.780429 -2.542672
elementType: O N C H
totalener: -1071.53882811 hartree
nucrepener: 1977.74097100 hartree
electener: -3049.27979911 hartree
oneelecener: -5388.07922527 hartree
twoeener: 2338.79942616 hartree
cpcmener: -0.05168172 hartree
kineticenergy: 1066.86221201 hartree
xcener: -102.624320698235 hartree
chargesum: 0.0000000
charge: -0.285860 -0.480736 -0.474841 -0.514211 -0.112460 -0.154215 0.146383 0.009318 -0.124482 -0.280356 -0.284294 -0.316746 0.401869 -0.006718 -0.229342 -0.232770 0.077514 0.319538 0.402448 -0.001567 -0.050911 -0.440508 0.071803 0.104197 0.100811 0.093120 0.098808 0.099113 0.101682 0.091079 0.096047 0.123970 0.095208 0.089944 0.097399 0.103481 0.103923 0.069182 0.141798 0.129783 0.129442 0.125508 0.135565 0.142667 0.288417
qa: -0.2859 -0.4807 -0.4748 -0.5142 -0.1125 -0.1542 0.1464 0.0093 -0.1245 -0.2804 -0.2843 -0.3167 0.4019 -0.0067 -0.2293 -0.2328 0.0775 0.3195 0.4024 -0.0016 -0.0509 -0.4405 0.0718 0.1042 0.1008 0.0931 0.0988 0.0991 0.1017 0.0911 0.0960 0.1240 0.0952 0.0899 0.0974 0.1035 0.1039 0.0692 0.1418 0.1298 0.1294 0.1255 0.1356 0.1427 0.2884
va: 2.1018 2.0207 2.0378 1.9976 3.1348 3.1941 3.6935 3.7865 3.8211 3.9060 3.8976 3.8961 4.1324 3.7304 3.9291 3.9314 3.8762 4.1708 4.2719 3.8984 3.9094 3.7614 3.5637 1.0253 1.0284 1.0025 1.0027 1.0007 0.9984 1.0174 1.0008 1.0043 0.9964 1.0061 0.9962 0.9985 1.0013 1.0141 1.0173 1.0137 1.0025 1.0100 0.9998 0.9867 0.9447
dispcorr: -0.022644605 hartree
energy: -1071.561472720045
dipole: -27.08811 27.56947 0.48136 -2.42758 0.76548 -1.66210 7.05894 -5.32827 1.73067
magnitude: 2.44735 au
magnitude: 6.22066 debye
