program: Orca
programVersion: 5.0.2
elementType: O O O O N N C C C C C C C C C C C C C C C C C H H H H H H H H H H H H H H H H H H H H H H
charge: 0
multiplicity: 1
keywords: wb97x-d3
keywords: def2-TZVPP
keywords: def2/J RIJCOSX
keywords: DEFGRID2
keywords: scfconv7
keywords: smallprint printgap noloewdin
keywords: NOSOSCF
formula: C17H22N2O4
InChI: InChI=1/C17H22N2O4/c1-6-7-18-9-13(20)19(16(18)22)10-23-15(21)14-12(8-11(2)3)17(14,4)5/h1,8,12,14H,7,9-10H2,2-5H3
45 atoms
O  0.467714 1.785797 0.844289
O  -0.138255 0.961408 -1.143475
O  2.098466 -0.309925 2.432439
O  2.792285 0.529343 -1.992663
N  2.333835 0.448657 0.279073
N  2.824967 -1.429046 -0.783354
C  -3.032534 1.724563 -0.24095
C  -2.794712 0.295735 0.126643
C  -1.788972 1.345907 0.551021
C  -4.071393 2.502892 0.528094
C  -2.943943 2.12946 -1.691048
C  -3.582378 -0.404369 1.173723
C  -0.441972 1.335056 -0.035341
C  -4.684692 -1.120568 0.938871
C  -5.410735 -1.818864 2.047362
C  -5.28565 -1.28413 -0.422844
C  1.834111 1.77966 0.463013
C  2.363567 -0.497277 1.269152
C  2.666607 -0.099852 -0.966148
C  2.784044 -1.782969 0.614952
C  3.480352 -2.267609 -1.75915
C  4.926752 -2.328112 -1.563938
C  6.113076 -2.377357 -1.378595
H  -2.466106 -0.324042 -0.703691
H  -1.817503 1.625749 1.598264
H  -3.891579 3.57569 0.439391
H  -5.067508 2.300134 0.128893
H  -4.082777 2.253196 1.588576
H  -3.943695 2.108707 -2.129175
H  -2.563457 3.14707 -1.797054
H  -2.317234 1.469067 -2.285283
H  -3.224721 -0.322732 2.196031
H  -6.446816 -1.477389 2.113284
H  -5.452308 -2.896558 1.869861
H  -4.938229 -1.655053 3.015607
H  -4.739532 -0.753512 -1.20132
H  -5.331999 -2.339547 -0.703132
H  -6.315949 -0.919599 -0.431166
H  2.004384 2.349392 -0.449109
H  2.357837 2.264295 1.282227
H  3.761966 -2.093484 0.995023
H  2.066079 -2.578375 0.820772
H  3.250674 -1.896052 -2.757258
H  3.058115 -3.271385 -1.699136
H  7.170272 -2.428094 -1.234897
elementType: O N C H
totalener: -1071.53912097 hartree
nucrepener: 1946.82383297 hartree
electener: -3018.36295395 hartree
oneelecener: -5326.58101742 hartree
twoeener: 2308.21806347 hartree
cpcmener: -0.05176170 hartree
kineticenergy: 1066.87059278 hartree
xcener: -102.625475640213 hartree
chargesum: -0.0000000
charge: -0.287662 -0.489428 -0.474684 -0.506969 -0.125267 -0.157190 0.132206 -0.014216 -0.120139 -0.275671 -0.299140 -0.251720 0.439228 -0.042214 -0.229970 -0.249409 0.081082 0.314235 0.393832 0.001153 -0.035326 -0.435482 0.053587 0.106505 0.092936 0.101344 0.097870 0.093424 0.096261 0.104648 0.093644 0.123763 0.094316 0.095638 0.090458 0.087676 0.102081 0.097361 0.137373 0.149883 0.128619 0.123035 0.132761 0.141796 0.287774
qa: -0.2877 -0.4894 -0.4747 -0.5070 -0.1253 -0.1572 0.1322 -0.0142 -0.1201 -0.2757 -0.2991 -0.2517 0.4392 -0.0422 -0.2300 -0.2494 0.0811 0.3142 0.3938 0.0012 -0.0353 -0.4355 0.0536 0.1065 0.0929 0.1013 0.0979 0.0934 0.0963 0.1046 0.0936 0.1238 0.0943 0.0956 0.0905 0.0877 0.1021 0.0974 0.1374 0.1499 0.1286 0.1230 0.1328 0.1418 0.2878
va: 2.1143 2.0170 2.0354 2.0091 3.1159 3.1889 3.6687 3.8060 3.8743 3.9091 3.8927 3.8535 4.1312 3.7068 3.9268 3.9369 3.8879 4.1775 4.3064 3.9102 3.9047 3.7463 3.5797 1.0204 1.0362 1.0028 1.0005 1.0019 1.0001 0.9993 1.0192 1.0058 0.9964 0.9953 1.0073 1.0078 0.9989 0.9976 1.0166 0.9925 1.0038 1.0101 1.0045 0.9866 0.9453
dispcorr: -0.021459177 hartree
energy: -1071.560580151694
dipole: -36.28795 35.75031 -0.53764 -1.54027 0.26128 -1.27899 1.15521 -0.57653 0.57867
magnitude: 1.50324 au
magnitude: 3.82094 debye
