program: Orca
programVersion: 5.0.2
elementType: O O O O N N C C C C C C C C C C C C C C C C C H H H H H H H H H H H H H H H H H H H H H H
charge: 0
multiplicity: 1
keywords: wb97x-d3
keywords: def2-TZVPP
keywords: def2/J RIJCOSX
keywords: DEFGRID2
keywords: scfconv7
keywords: smallprint printgap noloewdin
keywords: NOSOSCF
formula: C17H22N2O4
InChI: InChI=1/C17H22N2O4/c1-6-7-18-9-13(20)19(16(18)22)10-23-15(21)14-12(8-11(2)3)17(14,4)5/h1,8,12,14H,7,9-10H2,2-5H3
45 atoms
O  0.187369 1.034393 1.613098
O  -0.115003 -1.005615 0.744167
O  2.118917 2.612745 -0.106834
O  2.86569 -1.715852 1.109976
N  2.354786 0.530881 0.831753
N  3.624797 -0.474753 -0.673537
C  -2.078337 0.954174 -0.930836
C  -2.791607 -0.176416 -0.261199
C  -1.830694 0.657382 0.543051
C  -2.828138 2.230448 -1.219918
C  -1.003341 0.64894 -1.945231
C  -4.251152 -0.118164 0.018986
C  -0.531694 0.106946 0.962123
C  -4.841142 -0.521441 1.147196
C  -6.326504 -0.433392 1.324073
C  -4.097509 -1.089982 2.316217
C  1.518708 0.719699 1.981541
C  2.5382 1.480657 -0.138813
C  2.94035 -0.689347 0.472602
C  3.333642 0.824113 -1.230898
C  4.098632 -1.56254 -1.49632
C  3.053845 -2.089246 -2.37232
C  2.177297 -2.486125 -3.091656
H  -2.413782 -1.161221 -0.5271
H  -2.254741 1.382726 1.229257
H  -3.346868 2.162369 -2.178282
H  -3.569466 2.461303 -0.455053
H  -2.1384 3.074277 -1.277993
H  -1.438848 0.613159 -2.945529
H  -0.237724 1.428119 -1.948858
H  -0.510335 -0.307445 -1.775032
H  -4.878888 0.26402 -0.781736
H  -6.821184 -0.00799 0.451138
H  -6.758273 -1.419787 1.511149
H  -6.579995 0.182378 2.190732
H  -3.027105 -1.183101 2.144559
H  -4.246341 -0.473099 3.20619
H  -4.482554 -2.082268 2.564191
H  1.862345 1.575122 2.557369
H  1.572213 -0.169584 2.607698
H  2.726148 0.760446 -2.139049
H  4.2374 1.391169 -1.458704
H  4.487099 -2.354301 -0.855963
H  4.94109 -1.20594 -2.090129
H  1.402816 -2.860937 -3.723137
elementType: O N C H
totalener: -1071.53823687 hartree
nucrepener: 2006.20468637 hartree
electener: -3077.74292324 hartree
oneelecener: -5445.49197477 hartree
twoeener: 2367.74905153 hartree
cpcmener: -0.05391469 hartree
kineticenergy: 1066.86680056 hartree
xcener: -102.624858915878 hartree
chargesum: -0.0000000
charge: -0.277812 -0.476606 -0.474071 -0.505841 -0.113071 -0.160991 0.161609 0.004046 -0.158554 -0.286109 -0.278168 -0.306099 0.424305 -0.024418 -0.229609 -0.234487 0.068881 0.293740 0.398890 0.005599 -0.030154 -0.414497 0.029364 0.103406 0.107443 0.099661 0.094190 0.098538 0.104496 0.095054 0.083755 0.125286 0.089687 0.096993 0.094700 0.080414 0.098574 0.102013 0.152533 0.138510 0.128230 0.128845 0.135324 0.140732 0.285667
qa: -0.2778 -0.4766 -0.4741 -0.5058 -0.1131 -0.1610 0.1616 0.0040 -0.1586 -0.2861 -0.2782 -0.3061 0.4243 -0.0244 -0.2296 -0.2345 0.0689 0.2937 0.3989 0.0056 -0.0302 -0.4145 0.0294 0.1034 0.1074 0.0997 0.0942 0.0985 0.1045 0.0951 0.0838 0.1253 0.0897 0.0970 0.0947 0.0804 0.0986 0.1020 0.1525 0.1385 0.1282 0.1288 0.1353 0.1407 0.2857
va: 2.1117 2.0243 2.0271 2.0090 3.0995 3.1876 3.7125 3.8042 3.8273 3.8987 3.9014 3.8851 4.1425 3.7224 3.9298 3.9277 3.8891 4.1678 4.3046 3.9199 3.9038 3.7228 3.6154 1.0232 1.0258 0.9999 1.0024 1.0032 1.0024 1.0066 1.0097 1.0029 1.0062 0.9960 0.9970 1.0173 0.9991 0.9996 0.9920 1.0153 0.9997 1.0099 1.0014 0.9877 0.9473
dispcorr: -0.023791565 hartree
energy: -1071.562028437310
dipole: -29.53767 29.88918 0.35151 2.01184 -1.16609 0.84575 -3.75068 2.64719 -1.10349
magnitude: 1.43407 au
magnitude: 3.64511 debye
