program: Orca
programVersion: 5.0.2
elementType: O O O O N N C C C C C C C C C C C C C C C C C H H H H H H H H H H H H H H H H H H H H H H
charge: 0
multiplicity: 1
keywords: wb97x-d3
keywords: def2-TZVPP
keywords: def2/J RIJCOSX
keywords: DEFGRID2
keywords: scfconv7
keywords: smallprint printgap noloewdin
keywords: NOSOSCF
formula: C17H22N2O4
InChI: InChI=1/C17H22N2O4/c1-6-7-18-9-13(20)19(16(18)22)10-23-15(21)14-12(8-11(2)3)17(14,4)5/h1,8,12,14H,7,9-10H2,2-5H3
45 atoms
O  0.173001 1.508268 0.943813
O  -0.175132 -0.649879 1.414552
O  2.900202 -1.142624 1.831669
O  1.824131 1.667504 -1.595694
N  2.224198 0.492345 0.355967
N  2.812458 -0.414112 -1.568047
C  -2.444133 0.226615 -0.774387
C  -2.971952 -0.41358 0.46979
C  -1.969662 0.706225 0.588553
C  -3.314191 1.192839 -1.539709
C  -1.506135 -0.560699 -1.65659
C  -4.370222 -0.230467 0.936901
C  -0.595136 0.415522 1.03636
C  -4.771037 -0.389712 2.200919
C  -6.208139 -0.226556 2.590606
C  -3.83977 -0.739951 3.320553
C  1.553462 1.393584 1.244616
C  2.77881 -0.711102 0.71415
C  2.250994 0.686254 -1.029983
C  3.225632 -1.363181 -0.569077
C  3.018633 -0.611673 -2.978364
C  4.431051 -0.574357 -3.35029
C  5.592309 -0.57705 -3.656105
H  -2.550572 -1.39454 0.676011
H  -2.339476 1.683922 0.880241
H  -2.698711 1.882317 -2.120623
H  -3.961717 0.660744 -2.240187
H  -3.950105 1.792561 -0.888503
H  -0.897418 -1.276209 -1.10406
H  -2.076072 -1.127104 -2.396177
H  -0.832527 0.104425 -2.201888
H  -5.114881 0.021629 0.187215
H  -6.603656 -1.146516 3.029669
H  -6.323156 0.550841 3.350704
H  -6.837681 0.038004 1.740837
H  -4.133038 -1.68442 3.786972
H  -2.801021 -0.832807 3.00724
H  -3.882824 0.016505 4.108857
H  1.950008 2.400027 1.135986
H  1.7195 1.055411 2.26728
H  4.308285 -1.518315 -0.559566
H  2.740441 -2.335027 -0.692991
H  2.469975 0.157391 -3.522992
H  2.590894 -1.572241 -3.27706
H  6.624003 -0.561743 -3.928584
elementType: O N C H
totalener: -1071.54486357 hartree
nucrepener: 1978.85844862 hartree
electener: -3050.40331219 hartree
oneelecener: -5390.25878943 hartree
twoeener: 2339.85547723 hartree
cpcmener: -0.04135705 hartree
kineticenergy: 1066.87086098 hartree
xcener: -102.624624276010 hartree
chargesum: 0.0000000
charge: -0.272870 -0.450345 -0.441079 -0.484686 -0.121934 -0.134209 0.177472 -0.038809 -0.114481 -0.298721 -0.281530 -0.281047 0.392653 -0.020869 -0.227573 -0.240636 0.074193 0.296106 0.350835 -0.002107 -0.066554 -0.438520 0.087020 0.102092 0.100007 0.098951 0.100340 0.091439 0.090320 0.103726 0.092814 0.123425 0.094598 0.093430 0.088460 0.099110 0.077016 0.095430 0.148139 0.134847 0.126002 0.122553 0.129235 0.142126 0.283632
qa: -0.2729 -0.4503 -0.4411 -0.4847 -0.1219 -0.1342 0.1775 -0.0388 -0.1145 -0.2987 -0.2815 -0.2810 0.3927 -0.0209 -0.2276 -0.2406 0.0742 0.2961 0.3508 -0.0021 -0.0666 -0.4385 0.0870 0.1021 0.1000 0.0990 0.1003 0.0914 0.0903 0.1037 0.0928 0.1234 0.0946 0.0934 0.0885 0.0991 0.0770 0.0954 0.1481 0.1348 0.1260 0.1226 0.1292 0.1421 0.2836
va: 2.1210 2.0476 2.0790 2.0351 3.0950 3.1900 3.7182 3.8475 3.8088 3.9032 3.8834 3.8802 4.1765 3.7172 3.9294 3.9346 3.8954 4.2121 4.3273 3.8871 3.9056 3.7712 3.5428 1.0245 1.0284 1.0033 0.9986 1.0010 1.0117 1.0022 1.0097 1.0024 0.9958 0.9966 1.0066 0.9993 1.0239 0.9988 0.9930 1.0155 1.0052 1.0076 1.0086 0.9845 0.9478
dispcorr: -0.022989423 hartree
energy: -1071.567852997683
dipole: -30.71208 30.66641 -0.04566 -2.79351 2.48810 -0.30540 1.43252 -2.59338 -1.16087
magnitude: 1.20124 au
magnitude: 3.05330 debye
