program: Orca
programVersion: 5.0.2
elementType: O O O O N N C C C C C C C C C C C C C C C C C H H H H H H H H H H H H H H H H H H H H H H
charge: 0
multiplicity: 1
keywords: wb97x-d3
keywords: def2-TZVPP
keywords: def2/J RIJCOSX
keywords: DEFGRID2
keywords: scfconv7
keywords: smallprint printgap noloewdin
keywords: NOSOSCF
formula: C17H22N2O4
InChI: InChI=1/C17H22N2O4/c1-6-7-18-9-13(20)19(16(18)22)10-23-15(21)14-12(8-11(2)3)17(14,4)5/h1,8,12,14H,7,9-10H2,2-5H3
45 atoms
O  0.316974 1.349677 1.430788
O  -0.307248 -0.735092 0.920261
O  2.111639 2.407737 -0.813243
O  2.665827 -1.730225 1.017859
N  2.250512 0.468702 0.40678
N  2.965033 -0.950482 -1.126065
C  -2.37288 1.166868 -0.676779
C  -3.03424 0.213723 0.275878
C  -1.880851 1.064248 0.757507
C  -3.043031 2.465954 -1.051372
C  -1.538333 0.594632 -1.797048
C  -4.392065 0.424654 0.815788
C  -0.579337 0.433374 1.042294
C  -5.185687 -0.512565 1.345877
C  -6.557797 -0.164428 1.840107
C  -4.818452 -1.956593 1.508527
C  1.658061 0.933179 1.62568
C  2.380443 1.235871 -0.719595
C  2.634741 -0.860789 0.179385
C  2.909337 0.322996 -1.794276
C  3.5693 -2.116951 -1.716027
C  5.022245 -2.006021 -1.830824
C  6.214075 -1.897841 -1.937933
H  -2.763163 -0.822389 0.105506
H  -2.113356 1.92171 1.380326
H  -2.299859 3.183797 -1.404193
H  -3.762054 2.312625 -1.858778
H  -3.569686 2.931639 -0.219309
H  -0.728003 1.276375 -2.066358
H  -1.100228 -0.373186 -1.557104
H  -2.156609 0.45591 -2.686301
H  -4.775027 1.440022 0.777218
H  -6.658636 -0.380973 2.907157
H  -6.799282 0.88753 1.686272
H  -7.320582 -0.761503 1.332481
H  -3.796048 -2.189488 1.218258
H  -4.938594 -2.263415 2.550785
H  -5.484804 -2.595698 0.92281
H  2.179126 1.817094 1.985456
H  1.735915 0.145858 2.374822
H  2.235907 0.311894 -2.654827
H  3.892803 0.663736 -2.131583
H  3.13635 -2.279564 -2.705518
H  3.308826 -2.989884 -1.116733
H  7.273099 -1.804665 -2.029607
elementType: O N C H
totalener: -1071.54650239 hartree
nucrepener: 1962.96537041 hartree
electener: -3034.51187280 hartree
oneelecener: -5358.53377793 hartree
twoeener: 2324.02190513 hartree
cpcmener: -0.04301226 hartree
kineticenergy: 1066.86701857 hartree
xcener: -102.624485952360 hartree
chargesum: -0.0000000
charge: -0.273491 -0.448595 -0.447385 -0.478164 -0.122396 -0.147952 0.128835 -0.013457 -0.080702 -0.291998 -0.275647 -0.262550 0.388694 -0.037218 -0.223427 -0.255062 0.071859 0.277238 0.376119 0.002865 -0.055581 -0.430491 0.067381 0.099236 0.097231 0.097960 0.101522 0.090839 0.091593 0.091229 0.103564 0.114293 0.093298 0.087295 0.092254 0.088455 0.093659 0.096589 0.148669 0.136676 0.121626 0.128796 0.140939 0.131558 0.283845
qa: -0.2735 -0.4486 -0.4474 -0.4782 -0.1224 -0.1480 0.1288 -0.0135 -0.0807 -0.2920 -0.2756 -0.2626 0.3887 -0.0372 -0.2234 -0.2551 0.0719 0.2772 0.3761 0.0029 -0.0556 -0.4305 0.0674 0.0992 0.0972 0.0980 0.1015 0.0908 0.0916 0.0912 0.1036 0.1143 0.0933 0.0873 0.0923 0.0885 0.0937 0.0966 0.1487 0.1367 0.1216 0.1288 0.1409 0.1316 0.2838
va: 2.1170 2.0627 2.0650 2.0478 3.0950 3.1748 3.7194 3.8357 3.7736 3.9080 3.8948 3.8986 4.2285 3.7542 3.9250 3.9398 3.8938 4.2040 4.3256 3.9036 3.9053 3.7516 3.5675 1.0191 1.0301 1.0017 1.0000 1.0059 1.0072 1.0150 1.0014 1.0117 0.9965 1.0085 0.9956 1.0143 0.9974 0.9965 0.9920 1.0168 1.0057 1.0057 0.9855 1.0057 0.9478
dispcorr: -0.022088014 hartree
energy: -1071.568590405583
dipole: -32.70002 32.65891 -0.04111 0.40050 -0.07394 0.32656 -3.08708 1.69600 -1.39108
magnitude: 1.42949 au
magnitude: 3.63347 debye
