program: Orca
programVersion: 5.0.2
elementType: O O O O N N C C C C C C C C C C C C C C C C C H H H H H H H H H H H H H H H H H H H H H H
charge: 0
multiplicity: 1
keywords: wb97x-d3
keywords: def2-TZVPP
keywords: def2/J RIJCOSX
keywords: DEFGRID2
keywords: scfconv7
keywords: smallprint printgap noloewdin
keywords: NOSOSCF
formula: C17H22N2O4
InChI: InChI=1/C17H22N2O4/c1-6-7-18-9-13(20)19(16(18)22)10-23-15(21)14-12(8-11(2)3)17(14,4)5/h1,8,12,14H,7,9-10H2,2-5H3
45 atoms
O  0.227078 1.388418 0.337143
O  -0.348891 3.419168 1.054729
O  2.544278 0.160122 2.475749
O  2.436245 0.343378 -2.073979
N  2.370863 0.591027 0.226297
N  3.455548 -1.130646 -0.624638
C  -2.847036 1.618977 -0.532902
C  -2.485297 0.432716 0.31922
C  -2.056296 1.809309 0.748851
C  -4.267135 2.124977 -0.521596
C  -2.161414 1.774884 -1.867982
C  -3.49414 -0.293089 1.128932
C  -0.661781 2.297595 0.733376
C  -4.015073 -1.485147 0.824499
C  -5.010632 -2.149062 1.726691
C  -3.668903 -2.255016 -0.413048
C  1.594748 1.781486 0.284398
C  2.760987 -0.129269 1.326905
C  2.729284 -0.047346 -0.967743
C  3.501404 -1.330089 0.80109
C  3.905549 -2.123799 -1.565453
C  3.018346 -3.284145 -1.621268
C  2.287992 -4.236873 -1.652058
H  -1.702043 -0.187548 -0.104442
H  -2.624513 2.262697 1.555456
H  -4.730981 2.051631 0.461937
H  -4.307113 3.172334 -0.827709
H  -4.883242 1.553503 -1.219492
H  -2.068356 2.82802 -2.142535
H  -1.16588 1.332875 -1.89301
H  -2.750027 1.285524 -2.646849
H  -3.824881 0.191765 2.043351
H  -5.954593 -2.331295 1.206028
H  -4.64886 -3.12616 2.058738
H  -5.225724 -1.553013 2.613822
H  -2.978465 -1.731007 -1.071768
H  -3.224022 -3.22155 -0.161383
H  -4.571232 -2.474598 -0.989905
H  1.783004 2.385916 -0.602222
H  1.877321 2.348965 1.17002
H  4.523736 -1.354549 1.18581
H  2.994326 -2.248734 1.111153
H  4.910921 -2.445727 -1.285829
H  3.988858 -1.666724 -2.551875
H  1.651349 -5.092703 -1.682685
elementType: O N C H
totalener: -1071.54632038 hartree
nucrepener: 1942.25601562 hartree
electener: -3013.80233600 hartree
oneelecener: -5316.54561962 hartree
twoeener: 2302.74328362 hartree
cpcmener: -0.04193788 hartree
kineticenergy: 1066.87118480 hartree
xcener: -102.621911026636 hartree
chargesum: -0.0000000
charge: -0.266638 -0.459919 -0.444502 -0.488774 -0.131404 -0.157178 0.139332 0.034177 -0.155233 -0.268386 -0.280988 -0.286233 0.417184 -0.028594 -0.228081 -0.252182 0.066831 0.295834 0.390871 0.003001 -0.056001 -0.424801 0.063303 0.101175 0.097597 0.089760 0.098301 0.094547 0.101563 0.084158 0.095215 0.120022 0.093383 0.093324 0.088649 0.087628 0.098220 0.095085 0.142331 0.131820 0.123627 0.125572 0.140115 0.132408 0.283884
qa: -0.2666 -0.4599 -0.4445 -0.4888 -0.1314 -0.1572 0.1393 0.0342 -0.1552 -0.2684 -0.2810 -0.2862 0.4172 -0.0286 -0.2281 -0.2522 0.0668 0.2958 0.3909 0.0030 -0.0560 -0.4248 0.0633 0.1012 0.0976 0.0898 0.0983 0.0945 0.1016 0.0842 0.0952 0.1200 0.0934 0.0933 0.0886 0.0876 0.0982 0.0951 0.1423 0.1318 0.1236 0.1256 0.1401 0.1324 0.2839
va: 2.1018 2.0431 2.0732 2.0304 3.1596 3.1985 3.7023 3.7394 3.9405 3.9024 3.9016 3.8675 4.1522 3.7078 3.9279 3.9434 3.8810 4.1987 4.3008 3.8906 3.9023 3.7457 3.5775 1.0169 1.0322 1.0028 1.0029 1.0028 1.0013 1.0191 1.0018 1.0079 0.9965 0.9954 1.0081 1.0087 0.9979 0.9978 1.0042 1.0102 1.0072 1.0063 0.9853 1.0044 0.9479
dispcorr: -0.020943056 hartree
energy: -1071.567263434502
dipole: -30.50431 31.12675 0.62245 -7.66634 5.27272 -2.39362 -3.79695 3.17520 -0.62175
magnitude: 2.55019 au
magnitude: 6.48206 debye
