program: Orca
programVersion: 5.0.2
elementType: O O O O N N C C C C C C C C C C C C C C C C C H H H H H H H H H H H H H H H H H H H H H H
charge: 0
multiplicity: 1
keywords: wb97x-d3
keywords: def2-TZVPP
keywords: def2/J RIJCOSX
keywords: DEFGRID2
keywords: scfconv7
keywords: smallprint printgap noloewdin
keywords: NOSOSCF
formula: C17H22N2O4
InChI: InChI=1/C17H22N2O4/c1-6-7-18-9-13(20)19(16(18)22)10-23-15(21)14-12(8-11(2)3)17(14,4)5/h1,8,12,14H,7,9-10H2,2-5H3
45 atoms
O  0.064797 1.042011 0.592499
O  -0.240758 2.864799 1.834481
O  1.805072 1.047415 -2.213073
O  2.596496 -1.212994 1.664045
N  2.082758 0.201847 -0.095609
N  2.994766 -1.758542 -0.538702
C  -2.810366 1.918341 -0.367784
C  -2.764726 0.566534 0.287632
C  -2.15033 1.752338 0.991126
C  -4.109727 2.685338 -0.387766
C  -1.969081 2.155412 -1.597887
C  -3.970963 -0.056935 0.878606
C  -0.702042 1.952761 1.188834
C  -4.552778 -1.18903 0.471475
C  -5.768144 -1.723018 1.168183
C  -4.080239 -2.014407 -0.686026
C  1.473033 1.248398 0.651097
C  2.189998 0.186886 -1.462434
C  2.575174 -0.978308 0.478231
C  2.878415 -1.104055 -1.816126
C  3.730772 -2.98304 -0.355485
C  5.169117 -2.798809 -0.539593
C  6.347517 -2.643463 -0.711988
H  -2.058387 -0.121346 -0.164529
H  -2.722132 2.16837 1.81467
H  -4.736121 2.352283 -1.218264
H  -4.686392 2.56562 0.528858
H  -3.923352 3.752645 -0.523164
H  -1.649376 3.198054 -1.659112
H  -1.078869 1.530879 -1.644847
H  -2.557395 1.942459 -2.492825
H  -4.415043 0.465085 1.721681
H  -6.074843 -1.095134 2.005025
H  -6.613601 -1.801335 0.479212
H  -5.590752 -2.731143 1.552835
H  -4.876517 -2.120696 -1.427704
H  -3.213353 -1.598393 -1.196175
H  -3.824849 -3.027597 -0.363943
H  1.740785 2.210562 0.21425
H  1.832663 1.209764 1.678536
H  2.283652 -1.681146 -2.52762
H  3.852233 -0.895336 -2.270452
H  3.364272 -3.72976 -1.063229
H  3.526496 -3.372357 0.642237
H  7.395696 -2.502502 -0.854544
elementType: O N C H
totalener: -1071.54720773 hartree
nucrepener: 1927.12187376 hartree
electener: -2998.66908149 hartree
oneelecener: -5286.07999828 hartree
twoeener: 2287.41091679 hartree
cpcmener: -0.04164624 hartree
kineticenergy: 1066.86201063 hartree
xcener: -102.621308127077 hartree
chargesum: -0.0000000
charge: -0.267341 -0.461748 -0.447856 -0.482753 -0.125328 -0.158966 0.122376 0.061678 -0.133914 -0.265148 -0.272902 -0.298784 0.406400 -0.032089 -0.225708 -0.253138 0.061567 0.294950 0.384130 0.009063 -0.052277 -0.427515 0.064932 0.098426 0.093571 0.095387 0.088068 0.098313 0.101950 0.078702 0.095295 0.118565 0.088393 0.093169 0.093747 0.095053 0.088349 0.096264 0.141708 0.132862 0.122798 0.124090 0.139950 0.132418 0.283293
qa: -0.2673 -0.4617 -0.4479 -0.4828 -0.1253 -0.1590 0.1224 0.0617 -0.1339 -0.2651 -0.2729 -0.2988 0.4064 -0.0321 -0.2257 -0.2531 0.0616 0.2949 0.3841 0.0091 -0.0523 -0.4275 0.0649 0.0984 0.0936 0.0954 0.0881 0.0983 0.1020 0.0787 0.0953 0.1186 0.0884 0.0932 0.0937 0.0951 0.0883 0.0963 0.1417 0.1329 0.1228 0.1241 0.1399 0.1324 0.2833
va: 2.1071 2.0412 2.0658 2.0446 3.1532 3.1936 3.6982 3.7248 3.9153 3.9072 3.9145 3.8686 4.1531 3.7324 3.9259 3.9449 3.8982 4.1834 4.3119 3.8985 3.9003 3.7396 3.5768 1.0200 1.0344 1.0029 1.0043 1.0022 1.0005 1.0158 1.0026 1.0089 1.0086 0.9963 0.9956 0.9977 1.0092 0.9971 0.9983 1.0090 1.0092 1.0049 0.9857 1.0056 0.9481
dispcorr: -0.020916265 hartree
energy: -1071.568123999857
dipole: -31.97187 32.05981 0.08794 -2.92800 0.88114 -2.04686 -5.84487 4.01086 -1.83401
magnitude: 2.74972 au
magnitude: 6.98923 debye
