program: Orca
programVersion: 5.0.2
elementType: O O O O N N C C C C C C C C C C C C C C C C C H H H H H H H H H H H H H H H H H H H H H H
charge: 0
multiplicity: 1
keywords: wb97x-d3
keywords: def2-TZVPP
keywords: def2/J RIJCOSX
keywords: DEFGRID2
keywords: scfconv7
keywords: smallprint printgap noloewdin
keywords: NOSOSCF
formula: C17H22N2O4
InChI: InChI=1/C17H22N2O4/c1-6-7-18-9-13(20)19(16(18)22)10-23-15(21)14-12(8-11(2)3)17(14,4)5/h1,8,12,14H,7,9-10H2,2-5H3
45 atoms
O  0.137105 0.680334 0.051327
O  -0.922867 2.633766 0.22231
O  2.282551 0.07449 -2.59077
O  2.890605 0.130611 1.924946
N  2.378495 0.393261 -0.316623
N  3.94408 -1.053186 0.251387
C  -3.09719 0.787592 1.606691
C  -3.527591 1.175913 0.235185
C  -2.146707 0.582381 0.432753
C  -3.639677 -0.481697 2.217107
C  -2.831183 1.868804 2.624657
C  -4.562374 0.422895 -0.520662
C  -0.957156 1.425402 0.235074
C  -4.552696 0.22625 -1.84171
C  -5.653906 -0.522934 -2.527702
C  -3.459963 0.719007 -2.740125
C  1.360129 1.375489 -0.164848
C  2.740607 -0.183542 -1.50684
C  3.06916 -0.166931 0.766367
C  3.811967 -1.189251 -1.17567
C  4.791442 -1.902834 1.047617
C  4.299989 -3.277625 1.116799
C  3.893841 -4.407506 1.155774
H  -3.514238 2.248008 0.050944
H  -2.01809 -0.450496 0.128919
H  -3.792802 -1.270997 1.48078
H  -2.952588 -0.866429 2.97337
H  -4.596832 -0.294312 2.708585
H  -2.526268 2.812762 2.177779
H  -3.740554 2.061366 3.197723
H  -2.057398 1.563348 3.331913
H  -5.398871 0.033879 0.05395
H  -6.403443 -0.888667 -1.825593
H  -6.15999 0.109308 -3.262082
H  -5.26106 -1.381326 -3.079377
H  -2.911169 -0.119755 -3.177977
H  -3.875608 1.284052 -3.578278
H  -2.739782 1.359575 -2.234075
H  1.310254 1.980678 -1.069834
H  1.600578 2.017946 0.681432
H  3.493055 -2.192619 -1.472968
H  4.738654 -0.952415 -1.704621
H  4.867723 -1.482845 2.051061
H  5.800636 -1.896647 0.629329
H  3.534092 -5.411177 1.194802
elementType: O N C H
totalener: -1071.54828497 hartree
nucrepener: 1910.67696780 hartree
electener: -2982.22525277 hartree
oneelecener: -5253.70434220 hartree
twoeener: 2271.47908943 hartree
cpcmener: -0.03985752 hartree
kineticenergy: 1066.86148350 hartree
xcener: -102.621173371118 hartree
chargesum: 0.0000000
charge: -0.274835 -0.471131 -0.445938 -0.485705 -0.133831 -0.152637 0.147688 -0.014236 -0.094203 -0.286222 -0.277404 -0.293669 0.386954 -0.011919 -0.228354 -0.242566 0.082540 0.297506 0.385620 -0.000027 -0.054598 -0.423933 0.061519 0.102657 0.093931 0.092819 0.098524 0.098987 0.092674 0.095166 0.100267 0.121645 0.088788 0.096351 0.093684 0.100607 0.099737 0.082681 0.132480 0.133989 0.124987 0.123762 0.130876 0.141098 0.283673
qa: -0.2748 -0.4711 -0.4459 -0.4857 -0.1338 -0.1526 0.1477 -0.0142 -0.0942 -0.2862 -0.2774 -0.2937 0.3870 -0.0119 -0.2284 -0.2426 0.0825 0.2975 0.3856 -0.0000 -0.0546 -0.4239 0.0615 0.1027 0.0939 0.0928 0.0985 0.0990 0.0927 0.0952 0.1003 0.1216 0.0888 0.0964 0.0937 0.1006 0.0997 0.0827 0.1325 0.1340 0.1250 0.1238 0.1309 0.1411 0.2837
va: 2.1081 2.0316 2.0739 2.0398 3.1474 3.1912 3.7083 3.8119 3.8294 3.9098 3.8925 3.8933 4.1259 3.7061 3.9315 3.9367 3.8931 4.2002 4.3109 3.8933 3.8955 3.7411 3.5767 1.0266 1.0287 1.0019 1.0030 0.9996 1.0173 1.0012 0.9991 1.0035 1.0064 0.9962 0.9966 0.9981 1.0001 1.0139 1.0026 1.0033 1.0066 1.0067 1.0070 0.9850 0.9480
dispcorr: -0.020409308 hartree
energy: -1071.568694275272
dipole: -30.50386 31.53430 1.03044 -1.75579 -0.09977 -1.85556 -0.93839 0.60823 -0.33016
magnitude: 2.14801 au
magnitude: 5.45980 debye
