program: Orca
programVersion: 5.0.2
elementType: O O O O N N C C C C C C C C C C C C C C C C C H H H H H H H H H H H H H H H H H H H H H H
charge: 0
multiplicity: 1
keywords: wb97x-d3
keywords: def2-TZVPP
keywords: def2/J RIJCOSX
keywords: DEFGRID2
keywords: scfconv7
keywords: smallprint printgap noloewdin
keywords: NOSOSCF
formula: C17H22N2O4
InChI: InChI=1/C17H22N2O4/c1-6-7-18-9-13(20)19(16(18)22)10-23-15(21)14-12(8-11(2)3)17(14,4)5/h1,8,12,14H,7,9-10H2,2-5H3
45 atoms
O  -0.042525 0.318439 -0.249649
O  -1.303457 1.482729 -1.672199
O  1.458039 -2.556434 -1.110203
O  3.224814 1.41015 0.270581
N  2.096553 -0.405428 -0.618493
N  3.878005 -0.768507 0.633728
C  -2.977556 2.00678 0.968798
C  -3.661592 1.021761 0.086947
C  -2.199194 0.806303 0.44646
C  -3.250345 1.988257 2.453727
C  -2.702278 3.390527 0.43475
C  -4.70435 0.08314 0.570038
C  -1.177928 0.92645 -0.606281
C  -5.116109 -0.998472 -0.097312
C  -6.217447 -1.869048 0.425732
C  -4.531632 -1.429951 -1.406489
C  1.010827 0.301298 -1.207526
C  2.214741 -1.771976 -0.597582
C  3.106874 0.215387 0.127771
C  3.467397 -2.073025 0.18296
C  5.119595 -0.532076 1.324598
C  6.283749 -0.679228 0.4526
C  7.24074 -0.806888 -0.261735
H  -3.797174 1.36412 -0.935646
H  -1.989944 0.044412 1.18873
H  -4.151916 2.558176 2.688681
H  -3.381864 0.980202 2.847021
H  -2.422041 2.445559 2.998214
H  -3.531993 4.051837 0.6931
H  -1.797483 3.812164 0.877343
H  -2.593161 3.41911 -0.647363
H  -5.182657 0.317676 1.516568
H  -5.869589 -2.894099 0.579589
H  -6.619699 -1.504336 1.371063
H  -7.042909 -1.928686 -0.288942
H  -3.676016 -0.832507 -1.717907
H  -4.207215 -2.472699 -1.356555
H  -5.281366 -1.380233 -2.201139
H  0.698898 -0.210476 -2.118066
H  1.333576 1.310951 -1.458699
H  3.254116 -2.751465 1.012016
H  4.210705 -2.545454 -0.466781
H  5.199457 -1.229756 2.160831
H  5.0988 0.469037 1.756231
H  8.083103 -0.924016 -0.905697
elementType: O N C H
totalener: -1071.54832003 hartree
nucrepener: 1894.16800675 hartree
electener: -2965.71632678 hartree
oneelecener: -5220.62619822 hartree
twoeener: 2254.90987144 hartree
cpcmener: -0.03982745 hartree
kineticenergy: 1066.86314581 hartree
xcener: -102.621008451528 hartree
chargesum: -0.0000000
charge: -0.275217 -0.471923 -0.444248 -0.484212 -0.136020 -0.157988 0.148145 -0.044754 -0.060963 -0.292914 -0.267726 -0.273284 0.380397 -0.012930 -0.227906 -0.247479 0.085338 0.295660 0.386416 0.000693 -0.056642 -0.426453 0.066392 0.100875 0.090916 0.100816 0.090376 0.098894 0.094916 0.099087 0.092255 0.123763 0.094684 0.088325 0.094059 0.080405 0.094915 0.100002 0.135661 0.131961 0.122617 0.126401 0.140965 0.132159 0.283566
qa: -0.2752 -0.4719 -0.4442 -0.4842 -0.1360 -0.1580 0.1481 -0.0448 -0.0610 -0.2929 -0.2677 -0.2733 0.3804 -0.0129 -0.2279 -0.2475 0.0853 0.2957 0.3864 0.0007 -0.0566 -0.4265 0.0664 0.1009 0.0909 0.1008 0.0904 0.0989 0.0949 0.0991 0.0923 0.1238 0.0947 0.0883 0.0941 0.0804 0.0949 0.1000 0.1357 0.1320 0.1226 0.1264 0.1410 0.1322 0.2836
va: 2.1107 2.0283 2.0745 2.0422 3.1534 3.1874 3.7370 3.8310 3.8152 3.9173 3.8828 3.8836 4.1373 3.7103 3.9292 3.9443 3.8900 4.1986 4.3103 3.8886 3.8999 3.7393 3.5751 1.0249 1.0309 0.9990 1.0012 1.0027 1.0011 0.9997 1.0172 1.0032 0.9965 1.0070 0.9956 1.0157 0.9989 0.9981 0.9991 1.0064 1.0094 1.0044 0.9852 1.0049 0.9478
dispcorr: -0.020013476 hartree
energy: -1071.568333503552
dipole: -31.88741 32.79667 0.90926 1.77078 -3.08617 -1.31539 6.86831 -5.39486 1.47345
magnitude: 2.17441 au
magnitude: 5.52691 debye
