program: Orca
programVersion: 5.0.2
elementType: O O O O N N C C C C C C C C C C C C C C C C C H H H H H H H H H H H H H H H H H H H H H H
charge: 0
multiplicity: 1
keywords: wb97x-d3
keywords: def2-TZVPP
keywords: def2/J RIJCOSX
keywords: DEFGRID2
keywords: scfconv7
keywords: smallprint printgap noloewdin
keywords: NOSOSCF
formula: C17H22N2O4
InChI: InChI=1/C17H22N2O4/c1-6-7-18-9-13(20)19(16(18)22)10-23-15(21)14-12(8-11(2)3)17(14,4)5/h1,8,12,14H,7,9-10H2,2-5H3
45 atoms
O  0.333857 1.345848 1.309087
O  -0.270304 -0.764943 0.88655
O  2.183625 2.382622 -0.935424
O  2.726323 -1.712336 0.991858
N  2.291788 0.466309 0.322512
N  3.068225 -0.975695 -1.159868
C  -2.484096 0.987819 -0.655933
C  -3.070567 0.125845 0.426533
C  -1.882926 1.001965 0.740043
C  -3.199919 2.244802 -1.084902
C  -1.745355 0.312912 -1.78535
C  -4.370517 0.422805 1.061961
C  -0.559114 0.40163 0.983602
C  -5.393519 -0.424562 1.213844
C  -6.656829 0.014211 1.892187
C  -5.404659 -1.845888 0.740701
C  1.679745 0.95593 1.520971
C  2.458406 1.215183 -0.811701
C  2.70226 -0.860782 0.135393
C  3.038559 0.288958 -1.848014
C  3.762994 -2.127367 -1.676596
C  5.216371 -1.996494 -1.584859
C  6.409346 -1.877911 -1.510283
H  -2.82987 -0.9267 0.322715
H  -2.073465 1.909027 1.304623
H  -3.671922 2.770459 -0.255764
H  -2.501999 2.939129 -1.557183
H  -3.977528 2.011156 -1.815263
H  -1.311275 -0.645005 -1.50329
H  -2.4301 0.124606 -2.614682
H  -0.940917 0.948985 -2.163104
H  -4.49428 1.432056 1.444589
H  -7.517904 -0.09038 1.22636
H  -6.868233 -0.60563 2.767789
H  -6.610914 1.052839 2.220192
H  -5.6133 -2.52716 1.569774
H  -6.203999 -1.998714 0.010409
H  -4.473657 -2.165203 0.276201
H  2.185089 1.858009 1.857579
H  1.764623 0.192989 2.294171
H  2.407977 0.263375 -2.739653
H  4.036472 0.630003 -2.14034
H  3.471214 -2.275292 -2.717986
H  3.433257 -3.013874 -1.133917
H  7.469673 -1.778286 -1.443102
elementType: O N C H
totalener: -1071.54757048 hartree
nucrepener: 1949.79642837 hartree
electener: -3021.34399884 hartree
oneelecener: -5332.25239049 hartree
twoeener: 2310.90839165 hartree
cpcmener: -0.04393514 hartree
kineticenergy: 1066.87033169 hartree
xcener: -102.623880356457 hartree
chargesum: -0.0000000
charge: -0.273057 -0.450144 -0.448002 -0.477011 -0.122561 -0.155807 0.117443 0.032600 -0.115318 -0.267421 -0.277711 -0.276075 0.398185 -0.049512 -0.219154 -0.249640 0.069603 0.286594 0.379150 -0.000421 -0.053558 -0.430763 0.065964 0.091263 0.093915 0.087267 0.098105 0.097481 0.091164 0.100905 0.095538 0.117353 0.092541 0.093071 0.087592 0.094424 0.095546 0.089930 0.148884 0.136455 0.120936 0.127647 0.139593 0.133168 0.283839
qa: -0.2731 -0.4501 -0.4480 -0.4770 -0.1226 -0.1558 0.1174 0.0326 -0.1153 -0.2674 -0.2777 -0.2761 0.3982 -0.0495 -0.2192 -0.2496 0.0696 0.2866 0.3792 -0.0004 -0.0536 -0.4308 0.0660 0.0913 0.0939 0.0873 0.0981 0.0975 0.0912 0.1009 0.0955 0.1174 0.0925 0.0931 0.0876 0.0944 0.0955 0.0899 0.1489 0.1365 0.1209 0.1276 0.1396 0.1332 0.2838
va: 2.1178 2.0633 2.0670 2.0485 3.0972 3.1713 3.7022 3.7888 3.8278 3.9026 3.9049 3.8675 4.2109 3.7653 3.9225 3.9411 3.8933 4.2004 4.3260 3.9064 3.9100 3.7465 3.5735 1.0328 1.0345 1.0058 1.0022 1.0018 1.0157 1.0017 1.0033 1.0106 0.9963 0.9963 1.0090 0.9971 0.9971 1.0102 0.9923 1.0171 1.0069 1.0047 0.9859 1.0028 0.9478
dispcorr: -0.021596872 hartree
energy: -1071.569167348529
dipole: -34.60366 34.53266 -0.07100 0.17757 0.12728 0.30485 -3.97981 2.53450 -1.44531
magnitude: 1.47882 au
magnitude: 3.75886 debye
