program: Orca
programVersion: 5.0.2
elementType: O O O O N N C C C C C C C C C C C C C C C C C H H H H H H H H H H H H H H H H H H H H H H
charge: 0
multiplicity: 1
keywords: wb97x-d3
keywords: def2-TZVPP
keywords: def2/J RIJCOSX
keywords: DEFGRID2
keywords: scfconv7
keywords: smallprint printgap noloewdin
keywords: NOSOSCF
formula: C17H22N2O4
InChI: InChI=1/C17H22N2O4/c1-6-7-18-9-13(20)19(16(18)22)10-23-15(21)14-12(8-11(2)3)17(14,4)5/h1,8,12,14H,7,9-10H2,2-5H3
45 atoms
O  0.39053 1.061129 0.705018
O  -0.705517 2.332668 -0.783551
O  1.543422 0.088994 -2.168347
O  3.746963 0.230725 1.814484
N  2.480494 0.468767 -0.110342
N  4.033714 -1.095802 -0.045359
C  -3.105394 1.532505 1.120311
C  -3.20003 0.835441 -0.203431
C  -1.903578 0.774073 0.577234
C  -3.773144 0.924463 2.329506
C  -3.111674 3.041108 1.14015
C  -3.979426 -0.404745 -0.400725
C  -0.71535 1.482289 0.070471
C  -4.925785 -0.604771 -1.323903
C  -5.628264 -1.925291 -1.430485
C  -5.372282 0.418953 -2.323057
C  1.656643 1.55968 0.304471
C  2.342481 -0.182211 -1.307756
C  3.468585 -0.117215 0.690307
C  3.372098 -1.282104 -1.311238
C  5.027715 -2.003582 0.467104
C  4.457588 -3.269127 0.92817
C  3.992729 -4.311551 1.301704
H  -3.166079 1.508203 -1.053787
H  -1.686286 -0.157418 1.08921
H  -3.31752 1.299855 3.247875
H  -4.831845 1.191485 2.35397
H  -3.706488 -0.162622 2.351412
H  -2.72353 3.486377 0.226402
H  -4.135431 3.399502 1.265362
H  -2.526862 3.426054 1.978414
H  -3.746873 -1.226787 0.270487
H  -5.251799 -2.654342 -0.712665
H  -6.703267 -1.813287 -1.264634
H  -5.515025 -2.350268 -2.431717
H  -6.461426 0.505176 -2.320295
H  -4.966403 1.413025 -2.147175
H  -5.092114 0.121404 -3.337334
H  1.567704 2.281214 -0.504972
H  2.120336 2.042902 1.161523
H  2.881171 -2.25689 -1.387711
H  4.054309 -1.172886 -2.157681
H  5.563432 -1.517753 1.283458
H  5.764674 -2.198534 -0.314775
H  3.581399 -5.235961 1.640832
elementType: O N C H
totalener: -1071.54812716 hartree
nucrepener: 1899.55023982 hartree
electener: -2971.09836697 hartree
oneelecener: -5231.74213325 hartree
twoeener: 2260.64376627 hartree
cpcmener: -0.04281982 hartree
kineticenergy: 1066.86106053 hartree
xcener: -102.622544144487 hartree
chargesum: -0.0000000
charge: -0.278944 -0.455325 -0.446256 -0.486040 -0.117907 -0.158780 0.112068 0.046379 -0.133178 -0.262841 -0.278800 -0.284010 0.417043 -0.034862 -0.221063 -0.256859 0.064845 0.296451 0.387295 0.006333 -0.065422 -0.424355 0.068901 0.090071 0.092090 0.097741 0.096955 0.087289 0.093191 0.096134 0.098815 0.117137 0.087531 0.093619 0.092811 0.092440 0.091955 0.099319 0.141655 0.130571 0.125337 0.123208 0.132425 0.141709 0.283321
qa: -0.2789 -0.4553 -0.4463 -0.4860 -0.1179 -0.1588 0.1121 0.0464 -0.1332 -0.2628 -0.2788 -0.2840 0.4170 -0.0349 -0.2211 -0.2569 0.0648 0.2965 0.3873 0.0063 -0.0654 -0.4244 0.0689 0.0901 0.0921 0.0977 0.0970 0.0873 0.0932 0.0961 0.0988 0.1171 0.0875 0.0936 0.0928 0.0924 0.0920 0.0993 0.1417 0.1306 0.1253 0.1232 0.1324 0.1417 0.2833
va: 2.1096 2.0581 2.0737 2.0413 3.1230 3.1913 3.7023 3.7581 3.8492 3.9072 3.9084 3.8814 4.1774 3.7425 3.9243 3.9443 3.8719 4.2001 4.3149 3.8921 3.9027 3.7406 3.5726 1.0344 1.0372 1.0024 1.0024 1.0055 1.0174 1.0003 0.9997 1.0104 1.0091 0.9964 0.9954 0.9980 1.0080 0.9960 1.0186 1.0139 1.0059 1.0069 1.0038 0.9848 0.9480
dispcorr: -0.019847457 hartree
energy: -1071.567974614119
dipole: -35.51835 36.12829 0.60993 -0.54475 -1.02478 -1.56953 -0.57319 0.58760 0.01441
magnitude: 1.68394 au
magnitude: 4.28024 debye
