program: Orca
programVersion: 5.0.2
elementType: O O O O N N C C C C C C C C C C C C C C C C C H H H H H H H H H H H H H H H H H H H H H H
charge: 0
multiplicity: 1
keywords: wb97x-d3
keywords: def2-TZVPP
keywords: def2/J RIJCOSX
keywords: DEFGRID2
keywords: scfconv7
keywords: smallprint printgap noloewdin
keywords: NOSOSCF
formula: C17H22N2O4
InChI: InChI=1/C17H22N2O4/c1-6-7-18-9-13(20)19(16(18)22)10-23-15(21)14-12(8-11(2)3)17(14,4)5/h1,8,12,14H,7,9-10H2,2-5H3
45 atoms
O  0.366971 1.106502 0.872934
O  -0.564804 -0.514556 2.114471
O  3.664007 2.545443 0.061066
O  1.723681 -1.571276 -0.170321
N  2.524271 0.55615 0.248829
N  3.290498 -0.537511 -1.509043
C  -2.577041 -0.467554 -0.319115
C  -3.215434 0.145308 0.891743
C  -1.854149 0.627718 0.453271
C  -3.077777 -0.081624 -1.688861
C  -2.103456 -1.897768 -0.242208
C  -4.366483 1.071553 0.786128
C  -0.65412 0.318322 1.248358
C  -5.611417 0.826627 1.204949
C  -6.695415 1.848308 1.037072
C  -6.047785 -0.452654 1.850358
C  1.671137 0.840528 1.360666
C  3.417393 1.428336 -0.317263
C  2.444257 -0.644705 -0.465455
C  4.029329 0.698306 -1.485149
C  3.599623 -1.621231 -2.405478
C  4.821056 -2.330793 -2.028781
C  5.829788 -2.902396 -1.715535
H  -3.202709 -0.495167 1.768279
H  -1.821637 1.587735 -0.051187
H  -2.315614 -0.279178 -2.445319
H  -3.962205 -0.666448 -1.950884
H  -3.34673 0.971853 -1.760423
H  -2.887174 -2.560373 -0.615225
H  -1.219342 -2.055796 -0.863599
H  -1.865424 -2.218298 0.769756
H  -4.16946 2.03006 0.314017
H  -7.516274 1.453798 0.431915
H  -7.1299 2.1244 2.001726
H  -6.333845 2.758885 0.55901
H  -6.505831 -0.261278 2.824254
H  -6.813507 -0.943048 1.243012
H  -5.239507 -1.167186 1.995899
H  2.042371 1.731192 1.862905
H  1.679692 0.00759 2.060452
H  3.908365 1.272308 -2.406624
H  5.099195 0.544601 -1.312981
H  3.703081 -1.224061 -3.417375
H  2.757168 -2.313286 -2.428275
H  6.722931 -3.414554 -1.434605
elementType: O N C H
totalener: -1071.54737114 hartree
nucrepener: 1919.01512776 hartree
electener: -2990.56249890 hartree
oneelecener: -5270.65694824 hartree
twoeener: 2280.09444934 hartree
cpcmener: -0.04219141 hartree
kineticenergy: 1066.86747225 hartree
xcener: -102.623216535917 hartree
chargesum: 0.0000000
charge: -0.281360 -0.448418 -0.447990 -0.487250 -0.115134 -0.150996 0.145658 0.012613 -0.117795 -0.261883 -0.289454 -0.272507 0.384215 -0.035871 -0.225411 -0.250236 0.071089 0.297697 0.392028 -0.003007 -0.057356 -0.425536 0.065981 0.095846 0.090685 0.097588 0.096105 0.088013 0.097182 0.092033 0.096309 0.118795 0.093029 0.094032 0.088239 0.095189 0.095748 0.088992 0.126348 0.143428 0.122461 0.124709 0.139711 0.132678 0.283803
qa: -0.2814 -0.4484 -0.4480 -0.4873 -0.1151 -0.1510 0.1457 0.0126 -0.1178 -0.2619 -0.2895 -0.2725 0.3842 -0.0359 -0.2254 -0.2502 0.0711 0.2977 0.3920 -0.0030 -0.0574 -0.4255 0.0660 0.0958 0.0907 0.0976 0.0961 0.0880 0.0972 0.0920 0.0963 0.1188 0.0930 0.0940 0.0882 0.0952 0.0957 0.0890 0.1263 0.1434 0.1225 0.1247 0.1397 0.1327 0.2838
va: 2.1078 2.0625 2.0734 2.0327 3.1154 3.1866 3.6701 3.7820 3.8779 3.9049 3.8959 3.8739 4.1906 3.7246 3.9246 3.9438 3.8752 4.2004 4.2957 3.8956 3.9085 3.7417 3.5727 1.0273 1.0380 1.0025 1.0032 1.0039 1.0023 1.0100 1.0166 1.0083 0.9963 0.9960 1.0083 0.9978 0.9973 1.0089 1.0151 1.0166 1.0087 1.0036 0.9860 1.0033 0.9478
dispcorr: -0.020874847 hartree
energy: -1071.568245982444
dipole: -35.99474 36.43037 0.43563 -2.31638 2.46121 0.14483 -2.86909 0.80721 -2.06188
magnitude: 2.11237 au
magnitude: 5.36922 debye
