program: Orca
programVersion: 5.0.2
elementType: O O O O N N C C C C C C C C C C C C C C C C C H H H H H H H H H H H H H H H H H H H H H H
charge: 0
multiplicity: 1
keywords: wb97x-d3
keywords: def2-TZVPP
keywords: def2/J RIJCOSX
keywords: DEFGRID2
keywords: scfconv7
keywords: smallprint printgap noloewdin
keywords: NOSOSCF
formula: C17H22N2O4
InChI: InChI=1/C17H22N2O4/c1-6-7-18-9-13(20)19(16(18)22)10-23-15(21)14-12(8-11(2)3)17(14,4)5/h1,8,12,14H,7,9-10H2,2-5H3
45 atoms
O  0.321383 1.922879 0.911338
O  0.181949 -0.165765 1.694277
O  3.301062 -0.276834 2.1542
O  2.012622 1.962384 -1.60094
N  2.487378 1.083297 0.483495
N  3.342124 0.103437 -1.304012
C  -2.114581 0.260488 -0.643736
C  -2.596236 -0.355047 0.645969
C  -1.73135 0.874438 0.687544
C  -3.077558 1.044016 -1.499907
C  -1.069799 -0.478152 -1.444019
C  -4.003647 -0.266313 1.089764
C  -0.33604 0.785205 1.165938
C  -4.79805 -1.29469 1.402987
C  -6.201474 -1.066908 1.877994
C  -4.387223 -2.735012 1.333394
C  1.695526 2.000103 1.247976
C  3.164603 0.002147 0.990985
C  2.559595 1.132158 -0.911176
C  3.713218 -0.741758 -0.198532
C  3.437099 -0.326548 -2.676433
C  2.42644 -1.327602 -3.01569
C  1.589947 -2.151509 -3.269172
H  -2.081705 -1.272759 0.911636
H  -2.215601 1.820906 0.910474
H  -3.653538 0.372819 -2.140646
H  -3.785593 1.62982 -0.914542
H  -2.537326 1.736019 -2.149158
H  -0.404396 -1.081048 -0.825996
H  -1.54907 -1.153652 -2.155824
H  -0.456652 0.219657 -2.018151
H  -4.41507 0.735401 1.179166
H  -6.445903 -0.007172 1.953627
H  -6.926149 -1.532319 1.204297
H  -6.361875 -1.51906 2.860812
H  -4.290375 -3.160546 2.336608
H  -5.151158 -3.32602 0.821561
H  -3.445053 -2.896677 0.811929
H  1.983237 3.025131 1.028016
H  1.86644 1.802998 2.306062
H  4.79442 -0.870619 -0.115496
H  3.251225 -1.732718 -0.257024
H  4.435223 -0.732584 -2.851086
H  3.336883 0.541468 -3.328762
H  0.84524 -2.881362 -3.495815
elementType: O N C H
totalener: -1071.54669728 hartree
nucrepener: 1996.72983397 hartree
electener: -3068.27653125 hartree
oneelecener: -5426.28700625 hartree
twoeener: 2358.01047500 hartree
cpcmener: -0.04359799 hartree
kineticenergy: 1066.87009100 hartree
xcener: -102.623713233015 hartree
chargesum: 0.0000000
charge: -0.267903 -0.440306 -0.439864 -0.480617 -0.113172 -0.149183 0.150690 0.022239 -0.129255 -0.270447 -0.296875 -0.287174 0.386980 -0.032344 -0.222555 -0.259719 0.069396 0.293318 0.352817 -0.004721 -0.031598 -0.416157 0.034521 0.091604 0.100539 0.096912 0.088013 0.098932 0.088913 0.106413 0.092050 0.117256 0.087551 0.093545 0.093012 0.100600 0.092677 0.091510 0.149803 0.135527 0.123579 0.126782 0.139470 0.133400 0.283841
qa: -0.2679 -0.4403 -0.4399 -0.4806 -0.1132 -0.1492 0.1507 0.0222 -0.1293 -0.2704 -0.2969 -0.2872 0.3870 -0.0323 -0.2226 -0.2597 0.0694 0.2933 0.3528 -0.0047 -0.0316 -0.4162 0.0345 0.0916 0.1005 0.0969 0.0880 0.0989 0.0889 0.1064 0.0920 0.1173 0.0876 0.0935 0.0930 0.1006 0.0927 0.0915 0.1498 0.1355 0.1236 0.1268 0.1395 0.1334 0.2838
va: 2.1188 2.0721 2.0785 2.0374 3.0915 3.1886 3.7198 3.7983 3.8412 3.8977 3.9059 3.8828 4.2306 3.7339 3.9255 3.9433 3.8883 4.2066 4.3424 3.8906 3.8992 3.7344 3.6174 1.0299 1.0315 1.0022 1.0048 1.0025 1.0068 0.9998 1.0097 1.0099 1.0091 0.9966 0.9949 0.9956 0.9981 1.0074 0.9931 1.0162 1.0089 1.0039 0.9871 1.0030 0.9490
dispcorr: -0.023583413 hartree
energy: -1071.570280695003
dipole: -31.05941 31.32270 0.26330 -9.94996 9.49683 -0.45313 -3.41281 2.10750 -1.30530
magnitude: 1.40658 au
magnitude: 3.57525 debye
