program: Orca
programVersion: 5.0.2
elementType: O O O O N N C C C C C C C C C C C C C C C C C H H H H H H H H H H H H H H H H H H H H H H
charge: 0
multiplicity: 1
keywords: wb97x-d3
keywords: def2-TZVPP
keywords: def2/J RIJCOSX
keywords: DEFGRID2
keywords: scfconv7
keywords: smallprint printgap noloewdin
keywords: NOSOSCF
formula: C17H22N2O4
InChI: InChI=1/C17H22N2O4/c1-6-7-18-9-13(20)19(16(18)22)10-23-15(21)14-12(8-11(2)3)17(14,4)5/h1,8,12,14H,7,9-10H2,2-5H3
45 atoms
O  -0.030889 -0.187255 -1.174227
O  -0.988837 1.841453 -1.23427
O  1.884514 1.847359 0.374076
O  3.168288 -1.780973 -2.062278
N  2.268657 0.112996 -1.077792
N  4.158545 -0.702713 -0.285133
C  -2.29334 0.687193 1.411124
C  -3.296935 0.777853 0.299934
C  -1.97456 0.083601 0.051717
C  -2.506758 -0.297825 2.534809
C  -1.608813 1.953953 1.863876
C  -4.53928 -0.018861 0.275392
C  -0.979943 0.703147 -0.839834
C  -5.767417 0.429019 -0.005602
C  -6.938409 -0.507149 -0.017116
C  -6.108202 1.850694 -0.33431
C  1.105613 0.249484 -1.899487
C  2.548031 0.913598 -0.002932
C  3.214365 -0.909598 -1.224933
C  3.823952 0.383873 0.598085
C  5.26613 -1.593139 -0.054669
C  5.029186 -2.513178 1.056286
C  4.831046 -3.25452 1.979798
H  -3.363136 1.763763 -0.147023
H  -1.990478 -1.000627 0.024605
H  -3.188015 0.116374 3.28122
H  -2.922022 -1.247369 2.19922
H  -1.561303 -0.51392 3.036285
H  -0.601638 1.747685 2.232315
H  -1.533391 2.706763 1.082011
H  -2.172596 2.398067 2.686974
H  -4.430816 -1.076815 0.497023
H  -7.696252 -0.198853 0.708351
H  -7.430576 -0.508048 -0.993628
H  -6.650094 -1.532879 0.213492
H  -5.265745 2.536027 -0.26446
H  -6.515015 1.925092 -1.346431
H  -6.887857 2.220405 0.336925
H  1.219491 -0.391611 -2.770146
H  1.003058 1.281552 -2.227817
H  4.594837 1.158168 0.617059
H  3.645786 0.049252 1.624383
H  6.161425 -1.000705 0.145237
H  5.463296 -2.154919 -0.968285
H  4.651536 -3.922489 2.792449
elementType: O N C H
totalener: -1071.54802472 hartree
nucrepener: 1912.91696602 hartree
electener: -2984.46499073 hartree
oneelecener: -5258.50478808 hartree
twoeener: 2274.03979735 hartree
cpcmener: -0.04243770 hartree
kineticenergy: 1066.87130485 hartree
xcener: -102.625038581215 hartree
chargesum: 0.0000000
charge: -0.279598 -0.449347 -0.449292 -0.486446 -0.111182 -0.157794 0.108822 0.036934 -0.094656 -0.268385 -0.278448 -0.275652 0.388857 -0.047357 -0.217052 -0.253101 0.064019 0.298902 0.386012 0.006758 -0.059461 -0.423981 0.064821 0.091765 0.090637 0.097653 0.087635 0.097360 0.091498 0.095382 0.098516 0.115859 0.092434 0.092425 0.087303 0.090442 0.096889 0.094038 0.130114 0.143472 0.121277 0.125744 0.140347 0.132123 0.283716
qa: -0.2796 -0.4493 -0.4493 -0.4864 -0.1112 -0.1578 0.1088 0.0369 -0.0947 -0.2684 -0.2784 -0.2757 0.3889 -0.0474 -0.2171 -0.2531 0.0640 0.2989 0.3860 0.0068 -0.0595 -0.4240 0.0648 0.0918 0.0906 0.0977 0.0876 0.0974 0.0915 0.0954 0.0985 0.1159 0.0924 0.0924 0.0873 0.0904 0.0969 0.0940 0.1301 0.1435 0.1213 0.1257 0.1403 0.1321 0.2837
va: 2.1127 2.0597 2.0673 2.0411 3.1164 3.1942 3.6936 3.7805 3.8238 3.9066 3.8971 3.8754 4.1898 3.7630 3.9215 3.9418 3.8769 4.1933 4.3132 3.8929 3.9022 3.7400 3.5717 1.0330 1.0353 1.0019 1.0061 1.0020 1.0080 1.0171 1.0019 1.0116 0.9966 0.9961 1.0091 1.0100 0.9965 0.9976 1.0164 1.0149 1.0071 1.0055 0.9855 1.0043 0.9478
dispcorr: -0.020517490 hartree
energy: -1071.568542206372
dipole: -32.94363 34.04922 1.10559 3.39862 -4.06553 -0.66691 12.12421 -10.84464 1.27957
magnitude: 1.81780 au
magnitude: 4.62048 debye
