program: Orca
programVersion: 5.0.2
elementType: O O O O N N C C C C C C C C C C C C C C C C C H H H H H H H H H H H H H H H H H H H H H H
charge: 0
multiplicity: 1
keywords: wb97x-d3
keywords: def2-TZVPP
keywords: def2/J RIJCOSX
keywords: DEFGRID2
keywords: scfconv7
keywords: smallprint printgap noloewdin
keywords: NOSOSCF
formula: C17H22N2O4
InChI: InChI=1/C17H22N2O4/c1-6-7-18-9-13(20)19(16(18)22)10-23-15(21)14-12(8-11(2)3)17(14,4)5/h1,8,12,14H,7,9-10H2,2-5H3
45 atoms
O  -0.038844 -0.885744 0.665079
O  -1.458814 -1.482451 -0.967894
O  1.24394 0.025232 -2.099222
O  3.508694 -1.401275 1.586345
N  2.113046 -0.91623 -0.196852
N  4.039954 0.148198 -0.033031
C  -2.536131 1.418003 -0.336254
C  -3.495022 0.373509 0.154145
C  -2.035279 0.279648 0.541455
C  -2.539552 2.78792 0.297148
C  -2.20206 1.45346 -1.807271
C  -4.498042 0.652425 1.202692
C  -1.189097 -0.785343 -0.022892
C  -5.810548 0.405827 1.135364
C  -6.71328 0.745589 2.283241
C  -6.507736 -0.202592 -0.042671
C  0.99292 -1.725438 0.174317
C  2.130561 -0.092531 -1.290349
C  3.274428 -0.782647 0.574284
C  3.459711 0.613927 -1.26541
C  5.406928 0.420652 0.33248
C  6.36093 -0.263581 -0.538496
C  7.13012 -0.823898 -1.2714
H  -3.795626 -0.337632 -0.607833
H  -1.781582 0.568291 1.555905
H  -1.587684 3.292736 0.12042
H  -3.326467 3.406865 -0.139301
H  -2.699697 2.760287 1.374238
H  -2.886151 2.134156 -2.318311
H  -1.188583 1.825007 -1.972486
H  -2.288975 0.484192 -2.293578
H  -4.118915 1.10489 2.114751
H  -7.481794 1.461688 1.979162
H  -7.243993 -0.140255 2.642825
H  -6.169302 1.175247 3.124682
H  -5.845774 -0.441891 -0.87255
H  -7.025536 -1.12115 0.245893
H  -7.276666 0.475695 -0.422281
H  1.297421 -2.394897 0.975293
H  0.662899 -2.316107 -0.67755
H  4.051636 0.329466 -2.141252
H  3.326087 1.698056 -1.278358
H  5.562281 0.120276 1.369151
H  5.579612 1.498196 0.290371
H  7.817864 -1.321492 -1.918299
elementType: O N C H
totalener: -1071.54790265 hartree
nucrepener: 1907.13419744 hartree
electener: -2978.68210009 hartree
oneelecener: -5246.85269571 hartree
twoeener: 2268.17059563 hartree
cpcmener: -0.04175984 hartree
kineticenergy: 1066.86559070 hartree
xcener: -102.623725397729 hartree
chargesum: 0.0000000
charge: -0.281305 -0.448628 -0.449733 -0.484709 -0.112834 -0.161033 0.114329 0.039425 -0.101280 -0.266279 -0.281382 -0.278696 0.386549 -0.047047 -0.218624 -0.251099 0.067091 0.300281 0.385507 0.005644 -0.047294 -0.427178 0.060189 0.093269 0.090204 0.097014 0.097799 0.087972 0.098815 0.090564 0.096455 0.117099 0.092219 0.093022 0.087796 0.089819 0.095731 0.094817 0.130391 0.144035 0.123516 0.122996 0.131590 0.139345 0.283638
qa: -0.2813 -0.4486 -0.4497 -0.4847 -0.1128 -0.1610 0.1143 0.0394 -0.1013 -0.2663 -0.2814 -0.2787 0.3865 -0.0470 -0.2186 -0.2511 0.0671 0.3003 0.3855 0.0056 -0.0473 -0.4272 0.0602 0.0933 0.0902 0.0970 0.0978 0.0880 0.0988 0.0906 0.0965 0.1171 0.0922 0.0930 0.0878 0.0898 0.0957 0.0948 0.1304 0.1440 0.1235 0.1230 0.1316 0.1393 0.2836
va: 2.1101 2.0599 2.0672 2.0438 3.1188 3.1929 3.6906 3.7782 3.8391 3.9056 3.8953 3.8705 4.1921 3.7593 3.9215 3.9426 3.8729 4.1869 4.3156 3.8936 3.9029 3.7395 3.5798 1.0320 1.0360 1.0023 1.0021 1.0056 1.0021 1.0089 1.0171 1.0104 0.9964 0.9962 1.0089 1.0103 0.9970 0.9975 1.0168 1.0148 1.0050 1.0089 1.0060 0.9857 0.9480
dispcorr: -0.020614886 hartree
energy: -1071.568517536456
dipole: -33.83824 34.88399 1.04575 13.48540 -11.80486 1.68054 1.95526 -1.81044 0.14482
magnitude: 1.98464 au
magnitude: 5.04454 debye
