program: Orca
programVersion: 5.0.2
elementType: O O O O N N C C C C C C C C C C C C C C C C C H H H H H H H H H H H H H H H H H H H H H H
charge: 0
multiplicity: 1
keywords: wb97x-d3
keywords: def2-TZVPP
keywords: def2/J RIJCOSX
keywords: DEFGRID2
keywords: scfconv7
keywords: smallprint printgap noloewdin
keywords: NOSOSCF
formula: C17H22N2O4
InChI: InChI=1/C17H22N2O4/c1-6-7-18-9-13(20)19(16(18)22)10-23-15(21)14-12(8-11(2)3)17(14,4)5/h1,8,12,14H,7,9-10H2,2-5H3
45 atoms
O  0.504926 1.879455 1.2404
O  0.301975 1.734802 -0.981729
O  3.456778 1.716909 -1.319924
O  1.791578 -0.618979 2.220286
N  2.532574 0.863434 0.608707
N  2.99719 -1.28997 0.376318
C  -2.777483 1.725655 -0.413145
C  -2.312631 0.302746 -0.423918
C  -1.588276 1.326968 0.438561
C  -4.029404 2.083023 0.352025
C  -2.598078 2.551769 -1.662678
C  -3.04945 -0.787674 0.246789
C  -0.195876 1.671717 0.115508
C  -3.461428 -1.930021 -0.312706
C  -4.202918 -2.954127 0.4928
C  -3.260352 -2.294587 -1.751575
C  1.9092 2.035817 1.147902
C  3.171038 0.791558 -0.604911
C  2.377388 -0.398814 1.186251
C  3.449515 -0.668958 -0.84319
C  2.705181 -2.701567 0.450307
C  1.46152 -3.037634 -0.24323
C  0.438034 -3.275312 -0.825991
H  -1.772048 0.024903 -1.323043
H  -1.791958 1.2627 1.501695
H  -4.115784 1.550469 1.298372
H  -4.048177 3.151653 0.574368
H  -4.917929 1.852933 -0.239702
H  -3.508055 2.499239 -2.264056
H  -2.427605 3.60259 -1.419298
H  -1.77622 2.214295 -2.289426
H  -3.274817 -0.632632 1.298085
H  -4.34844 -2.640829 1.526769
H  -5.186702 -3.158011 0.061162
H  -3.667654 -3.907589 0.503131
H  -2.635596 -1.593568 -2.301971
H  -2.81244 -3.287351 -1.843931
H  -4.223689 -2.347575 -2.26674
H  2.188594 2.890237 0.531678
H  2.241992 2.211346 2.167902
H  2.88417 -1.007764 -1.717785
H  4.510956 -0.841265 -1.031211
H  2.646508 -3.003284 1.496381
H  3.538336 -3.25484 0.014675
H  -0.468163 -3.488426 -1.348174
elementType: O N C H
totalener: -1071.54540390 hartree
nucrepener: 2016.65157363 hartree
electener: -3088.19697753 hartree
oneelecener: -5466.20204582 hartree
twoeener: 2378.00506828 hartree
cpcmener: -0.04373241 hartree
kineticenergy: 1066.88167988 hartree
xcener: -102.625102101222 hartree
chargesum: 0.0000000
charge: -0.280931 -0.460780 -0.438938 -0.475207 -0.128316 -0.170264 0.126095 0.032623 -0.108582 -0.266532 -0.279922 -0.264576 0.397160 -0.054199 -0.215235 -0.279428 0.088690 0.290964 0.373053 -0.001995 -0.045372 -0.432194 0.065186 0.097576 0.087263 0.087772 0.097892 0.096840 0.093227 0.098310 0.093808 0.118121 0.088316 0.093507 0.092593 0.096700 0.092075 0.111777 0.133043 0.147431 0.125213 0.121814 0.135539 0.139077 0.280807
qa: -0.2809 -0.4608 -0.4389 -0.4752 -0.1283 -0.1703 0.1261 0.0326 -0.1086 -0.2665 -0.2799 -0.2646 0.3972 -0.0542 -0.2152 -0.2794 0.0887 0.2910 0.3731 -0.0020 -0.0454 -0.4322 0.0652 0.0976 0.0873 0.0878 0.0979 0.0968 0.0932 0.0983 0.0938 0.1181 0.0883 0.0935 0.0926 0.0967 0.0921 0.1118 0.1330 0.1474 0.1252 0.1218 0.1355 0.1391 0.2808
va: 2.1125 2.0472 2.0803 2.0478 3.0952 3.1865 3.7026 3.7697 3.8599 3.9096 3.8954 3.8522 4.1527 3.7480 3.9202 3.9440 3.8871 4.2028 4.3437 3.8985 3.9064 3.7107 3.5478 1.0274 1.0395 1.0053 1.0025 1.0024 1.0002 0.9998 1.0206 1.0098 1.0091 0.9961 0.9970 1.0072 0.9937 0.9979 1.0164 0.9916 1.0044 1.0091 1.0001 0.9871 0.9482
dispcorr: -0.022971656 hartree
energy: -1071.568375558424
dipole: -30.63793 30.41500 -0.22293 -7.00048 5.60153 -1.39895 -6.18007 6.12578 -0.05429
magnitude: 1.41764 au
magnitude: 3.60335 debye
