program: Orca
programVersion: 5.0.2
elementType: O O O O N N C C C C C C C C C C C C C C C C C H H H H H H H H H H H H H H H H H H H H H H
charge: 0
multiplicity: 1
keywords: wb97x-d3
keywords: def2-TZVPP
keywords: def2/J RIJCOSX
keywords: DEFGRID2
keywords: scfconv7
keywords: smallprint printgap noloewdin
keywords: NOSOSCF
formula: C17H22N2O4
InChI: InChI=1/C17H22N2O4/c1-6-7-18-9-13(20)19(16(18)22)10-23-15(21)14-12(8-11(2)3)17(14,4)5/h1,8,12,14H,7,9-10H2,2-5H3
45 atoms
O  0.430234 1.788435 0.824443
O  -0.196182 0.969386 -1.158154
O  2.060749 -0.314441 2.388938
O  2.820421 0.589615 -2.014417
N  2.298807 0.46227 0.242796
N  3.000478 -1.353751 -0.795548
C  -3.074033 1.766976 -0.223743
C  -2.851667 0.330144 0.129638
C  -1.829289 1.364419 0.551692
C  -4.096318 2.552962 0.559946
C  -2.990202 2.183928 -1.671046
C  -3.637136 -0.367488 1.179301
C  -0.486134 1.343897 -0.048992
C  -4.699909 -1.142657 0.949159
C  -5.420203 -1.826355 2.070878
C  -5.261734 -1.391662 -0.416284
C  1.791404 1.788636 0.431067
C  2.358483 -0.481513 1.232323
C  2.722486 -0.04855 -0.9927
C  2.857725 -1.744689 0.581668
C  3.59143 -2.206185 -1.794193
C  5.009911 -2.453645 -1.544738
C  6.168195 -2.670455 -1.312384
H  -2.538929 -0.287167 -0.708418
H  -1.842931 1.635849 1.60174
H  -3.895381 3.623847 0.491219
H  -5.097826 2.378518 0.160306
H  -4.113568 2.285872 1.616462
H  -3.991977 2.177312 -2.106033
H  -2.599368 3.198702 -1.770918
H  -2.371535 1.523936 -2.274618
H  -3.31111 -0.23129 2.206612
H  -6.470208 -1.523544 2.106588
H  -5.41713 -2.911519 1.937009
H  -4.974172 -1.60771 3.041263
H  -4.719646 -0.876067 -1.207717
H  -5.261935 -2.459758 -0.649814
H  -6.304807 -1.067417 -0.465238
H  1.950402 2.356465 -0.484945
H  2.319115 2.27791 1.2462
H  3.807141 -2.05136 1.030545
H  2.137696 -2.556417 0.712249
H  3.456288 -1.746341 -2.77345
H  3.055305 -3.157573 -1.819105
H  7.19871 -2.864863 -1.114695
elementType: O N C H
totalener: -1071.54644769 hartree
nucrepener: 1937.63119775 hartree
electener: -3009.17764544 hartree
oneelecener: -5308.02368000 hartree
twoeener: 2298.84603456 hartree
cpcmener: -0.04217628 hartree
kineticenergy: 1066.87303786 hartree
xcener: -102.624523615956 hartree
chargesum: 0.0000000
charge: -0.283259 -0.461380 -0.448065 -0.480915 -0.127414 -0.146265 0.143749 -0.018734 -0.125511 -0.270173 -0.296677 -0.249282 0.416962 -0.037423 -0.228796 -0.249295 0.078478 0.287999 0.378637 0.001519 -0.051923 -0.430344 0.064571 0.104268 0.089921 0.099881 0.095975 0.091479 0.093902 0.101944 0.094798 0.120430 0.093240 0.094185 0.089638 0.087503 0.099235 0.095926 0.134986 0.147118 0.123360 0.121026 0.129955 0.141498 0.283274
qa: -0.2833 -0.4614 -0.4481 -0.4809 -0.1274 -0.1463 0.1437 -0.0187 -0.1255 -0.2702 -0.2967 -0.2493 0.4170 -0.0374 -0.2288 -0.2493 0.0785 0.2880 0.3786 0.0015 -0.0519 -0.4303 0.0646 0.1043 0.0899 0.0999 0.0960 0.0915 0.0939 0.1019 0.0948 0.1204 0.0932 0.0942 0.0896 0.0875 0.0992 0.0959 0.1350 0.1471 0.1234 0.1210 0.1300 0.1415 0.2833
va: 2.1160 2.0496 2.0705 2.0453 3.1036 3.1844 3.6662 3.8022 3.8824 3.9085 3.8956 3.8609 4.1597 3.7054 3.9277 3.9400 3.8917 4.2165 4.3242 3.9003 3.9020 3.7493 3.5693 1.0209 1.0376 1.0028 1.0020 1.0023 1.0005 0.9995 1.0196 1.0070 0.9964 0.9957 1.0077 1.0082 0.9986 0.9977 1.0184 0.9918 1.0055 1.0078 1.0083 0.9849 0.9483
dispcorr: -0.021151774 hartree
energy: -1071.567599459648
dipole: -36.37292 35.93388 -0.43904 -1.60141 0.40941 -1.19200 1.38399 -0.89497 0.48902
magnitude: 1.36116 au
magnitude: 3.45980 debye
