program: Orca
programVersion: 5.0.2
elementType: O O O O N N C C C C C C C C C C C C C C C C C H H H H H H H H H H H H H H H H H H H H H H
charge: 0
multiplicity: 1
keywords: wb97x-d3
keywords: def2-TZVPP
keywords: def2/J RIJCOSX
keywords: DEFGRID2
keywords: scfconv7
keywords: smallprint printgap noloewdin
keywords: NOSOSCF
formula: C17H22N2O4
InChI: InChI=1/C17H22N2O4/c1-6-7-18-9-13(20)19(16(18)22)10-23-15(21)14-12(8-11(2)3)17(14,4)5/h1,8,12,14H,7,9-10H2,2-5H3
45 atoms
O  0.137696 1.03754 -0.004784
O  -0.88468 2.414807 -1.437955
O  0.676525 -1.613213 -1.715148
O  3.619896 0.663948 0.916824
N  2.011568 -0.164571 -0.529345
N  3.369324 -1.585402 0.483736
C  -3.172473 2.435012 0.707074
C  -3.483011 1.401944 -0.321571
C  -2.121124 1.400276 0.348014
C  -3.768438 2.283135 2.087298
C  -3.017408 3.874665 0.282445
C  -4.443091 0.297768 -0.064476
C  -0.931605 1.704167 -0.469229
C  -4.265276 -0.985613 -0.382785
C  -5.316172 -2.010504 -0.077449
C  -3.040159 -1.520201 -1.058557
C  1.30902 1.046342 -0.800518
C  1.602725 -1.395059 -0.986453
C  3.081592 -0.259541 0.369561
C  2.562835 -2.399874 -0.382492
C  4.538181 -2.073705 1.165352
C  5.543672 -2.594121 0.241931
C  6.347539 -3.040147 -0.528185
H  -3.459469 1.771277 -1.344477
H  -1.963231 0.628393 1.092203
H  -3.153565 2.795949 2.828624
H  -4.76652 2.724427 2.125051
H  -3.857034 1.240132 2.390968
H  -2.336695 4.407435 0.949033
H  -2.642391 3.97989 -0.732066
H  -3.986198 4.375143 0.334933
H  -5.380745 0.583178 0.405154
H  -4.916267 -2.802043 0.561143
H  -6.180259 -1.577949 0.425302
H  -5.666585 -2.497138 -0.990893
H  -2.316411 -0.755103 -1.325086
H  -2.532418 -2.251599 -0.425106
H  -3.311975 -2.047047 -1.976239
H  1.060416 1.097223 -1.859967
H  1.950393 1.887065 -0.53764
H  2.014331 -3.176818 0.156784
H  3.150299 -2.883265 -1.170039
H  4.254973 -2.857295 1.87415
H  4.953038 -1.251928 1.7504
H  7.0702 -3.422623 -1.208548
totalener: -1071.51888835 hartree
nucrepener: 1927.71509757 hartree
electener: -2999.23398592 hartree
oneelecener: -5287.42839002 hartree
twoeener: 2288.19440410 hartree
kineticenergy: 1066.94511347 hartree
xcener: -102.627498342327 hartree
chargesum: 0.0000000
charge: -0.266713 -0.385570 -0.348346 -0.381352 -0.141045 -0.170981 0.129848 -0.011551 -0.118297 -0.267441 -0.259466 -0.243845 0.335831 -0.003684 -0.211607 -0.216315 0.072707 0.238159 0.342160 -0.016768 -0.088488 -0.399427 0.104362 0.106750 0.088587 0.092346 0.089189 0.085117 0.085342 0.102639 0.081690 0.092635 0.083078 0.077704 0.087741 0.092385 0.080093 0.088975 0.129935 0.126964 0.102511 0.109726 0.123752 0.131800 0.248870
qa: -0.2667 -0.3856 -0.3483 -0.3814 -0.1410 -0.1710 0.1298 -0.0116 -0.1183 -0.2674 -0.2595 -0.2438 0.3358 -0.0037 -0.2116 -0.2163 0.0727 0.2382 0.3422 -0.0168 -0.0885 -0.3994 0.1044 0.1068 0.0886 0.0923 0.0892 0.0851 0.0853 0.1026 0.0817 0.0926 0.0831 0.0777 0.0877 0.0924 0.0801 0.0890 0.1299 0.1270 0.1025 0.1097 0.1238 0.1318 0.2489
va: 2.0955 2.1106 2.1604 2.1447 3.1271 3.1392 3.7298 3.8173 3.8615 3.9083 3.9051 3.8867 4.1703 3.7340 3.9410 3.9398 3.9042 4.2317 4.3407 3.8928 3.9168 3.7753 3.6361 1.0240 1.0293 1.0062 1.0023 1.0058 1.0022 1.0211 1.0016 1.0107 0.9996 1.0099 0.9991 1.0182 1.0043 1.0036 1.0061 1.0080 1.0105 1.0095 0.9838 1.0102 0.9705
dispcorr: -0.021261247 hartree
energy: -1071.540149594278
dipole: -29.75381 30.09644 0.34263 0.42237 -1.86528 -1.44291 5.13923 -4.48534 0.65389
magnitude: 1.62079 au
magnitude: 4.11971 debye
